{"text_format":"1","workbook":"xlsx","n_sheets":3,"sheets":["INGRESO DE DATOS","Bupa Flex","Tablas"],"not_rendered":{"charts":0,"images":2,"macros":1,"external_links":0,"defined_names":0,"comments":1,"pivot_tables":0},"unopened":[],"bounds":{"document_bytes":16777216,"sheet_cells":100000,"rows_first":2000,"rows_last":500,"rows_between":2000,"halvings":0,"cell_chars":16384,"cell_head_chars":4096},"cells_cut":0,"cells_raw":0,"read":"whole","date_system":"1900"}

{"sheet":"INGRESO DE DATOS","index":0,"n_rows":27,"n_cols":12,"rows_kept":27,"cut":false,"hidden":false,"merged":[[7,0,7,9],[14,3,14,9],[9,2,9,3],[23,3,23,9]]}
[]
[null,null,null,null,null,null,null,null," "," "," "]
[null,"ARGENTINA"]
[]
[]
[null,null,null,null,null,null,null,null," "," "," "," "]
[]
["COTIZACIÓN DE SEGURO MÉDICO"]
[]
["1. SELECCIONE EL PAIS :",null,"ARGENTINA"]
[]
[]
["2. INGRESE LOS DATOS DEL PROPUESTO ASEGURADO :"]
[]
[null,null,"Nombre del Asegurado principal :","NOMBRE Y APELLIDO"]
[]
[null,null,null,null,null,"Número de adultos en la póliza : ",1,null,"Número de hijos en la póliza :",0]
[]
[null,null,null,null,null," Edad del titular :",18,null,"Edad de cónyuge :",18]
[]
[]
["3. INGRESE EL NOMBRE DE LA AGENCIA ASESORA :"]
[]
[null,null,"Nombre de la Agencia :","AGENCIA"]
[]
[]
["4. ESCOJA EL PRODUCTO PARA VISUALIZAR LA COTIZACION RESPECTIVA :"]

{"sheet":"Bupa Flex","index":1,"n_rows":44,"n_cols":11,"rows_kept":44,"cut":false,"hidden":false,"merged":[[43,3,45,10],[16,3,16,4],[17,3,17,4],[9,5,9,7],[13,5,13,10],[9,0,9,1],[11,5,11,10],[22,3,22,10],[32,3,32,10],[42,3,42,10]]}
[]
[null,null,null,null,null,null,null," "," "," "]
[]
[]
[]
[null,null,null,null,null,null,null," "," "," "," "]
[]
[]
[]
["Cotización de Seguro Médico - Bupa FLEX",null,null,null,"País: ",{"$f":"+'INGRESO DE DATOS'!$C$10","v":"ARGENTINA"}]
[]
[null,null,null,null,"Nombre del asegurado :",{"$f":"+'INGRESO DE DATOS'!$D$15","v":"NOMBRE Y APELLIDO"}]
[]
[null,null,null,null,"Broker / Agente :",{"$f":"+'INGRESO DE DATOS'!$D$24","v":"AGENCIA"}]
[]
[null,null,null,null,null,null,"Número de adultos en la póliza:",{"$f":"+'INGRESO DE DATOS'!$G$17","v":1},null,"Edad de Titular :",{"$f":"+'INGRESO DE DATOS'!$G$19","v":18}]
[]
[null,null,null,null,null,null,"Número hijos (menos 24 de años):",{"$f":"+'INGRESO DE DATOS'!$J$17","v":0},null,"Edad de Cónyuge:",{"$f":"+'INGRESO DE DATOS'!$J$19","v":18}]
[]
[null,null,null,"Deducibles",null,"PLAN 2","PLAN 3","PLAN 4","PLAN 5","PLAN 6","PLAN 7"]
[null,null,null,"Dentro o fuera del pais de residencia",null,500,1000,2000,4000,5000,10000]
[]
[null,null,null,"Tarifas Anuales"]
[null,null,null,"Prima de Titular :",null,{"$f":"IF(OR($F10=\"CHILE\",$F10=\"HAITI\",$F10=\"HONDURAS\"),VLOOKUP($K$16,Tablas!$A$6:$H$68,3,TRUE),IF(OR($F10=\"COSTA RICA\",$F10=\"EL SALVADOR\"),VLOOKUP($K$16,Tablas!$A$151:$H$213,3,TRUE),IF(OR($F10=\"BELIZE\",$F10=\"GUYANA\",$F10=\"NICARAGUA\",$F10=\"SURINAME\",$F10=\"URUGUAY\",$F10=\"CARIBBEAN\",$F10=\"PERU\"),VLOOKUP($K$16,Tablas!$A$296:$H$358,3,TRUE),IF($F10=\"VENEZUELA\",VLOOKUP($K$16,Tablas!$A$441:$H$503,3,TRUE),IF(OR($F10=\"ARGENTINA\",$F10=\"COLOMBIA\",$F10=\"PARAGUAY\"),VLOOKUP($K$16,Tablas!$A$586:$H$648,3,TRUE),0)))))","v":2864},{"$f":"IF(OR($F10=\"CHILE\",$F10=\"HAITI\",$F10=\"HONDURAS\"),VLOOKUP($K$16,Tablas!$A$6:$H$68,4,TRUE),IF(OR($F10=\"COSTA RICA\",$F10=\"EL SALVADOR\"),VLOOKUP($K$16,Tablas!$A$151:$H$213,4,TRUE),IF(OR($F10=\"BELIZE\",$F10=\"GUYANA\",$F10=\"NICARAGUA\",$F10=\"SURINAME\",$F10=\"URUGUAY\",$F10=\"CARIBBEAN\",$F10=\"PERU\"),VLOOKUP($K$16,Tablas!$A$296:$H$358,4,TRUE),IF($F10=\"VENEZUELA\",VLOOKUP($K$16,Tablas!$A$441:$H$503,4,TRUE),IF(OR($F10=\"ARGENTINA\",$F10=\"COLOMBIA\",$F10=\"PARAGUAY\"),VLOOKUP($K$16,Tablas!$A$586:$H$648,4,TRUE),0)))))","v":2605},{"$f":"IF(OR($F10=\"CHILE\",$F10=\"HAITI\",$F10=\"HONDURAS\"),VLOOKUP($K$16,Tablas!$A$6:$H$68,5,TRUE),IF(OR($F10=\"COSTA RICA\",$F10=\"EL SALVADOR\"),VLOOKUP($K$16,Tablas!$A$151:$H$213,5,TRUE),IF(OR($F10=\"BELIZE\",$F10=\"GUYANA\",$F10=\"NICARAGUA\",$F10=\"SURINAME\",$F10=\"URUGUAY\",$F10=\"CARIBBEAN\",$F10=\"PERU\"),VLOOKUP($K$16,Tablas!$A$296:$H$358,5,TRUE),IF($F10=\"VENEZUELA\",VLOOKUP($K$16,Tablas!$A$441:$H$503,5,TRUE),IF(OR($F10=\"ARGENTINA\",$F10=\"COLOMBIA\",$F10=\"PARAGUAY\"),VLOOKUP($K$16,Tablas!$A$586:$H$648,5,TRUE),0)))))","v":2021},{"$f":"IF(OR($F10=\"CHILE\",$F10=\"HAITI\",$F10=\"HONDURAS\"),VLOOKUP($K$16,Tablas!$A$6:$H$68,6,TRUE),IF(OR($F10=\"COSTA RICA\",$F10=\"EL SALVADOR\"),VLOOKUP($K$16,Tablas!$A$151:$H$213,6,TRUE),IF(OR($F10=\"BELIZE\",$F10=\"GUYANA\",$F10=\"NICARAGUA\",$F10=\"SURINAME\",$F10=\"URUGUAY\",$F10=\"CARIBBEAN\",$F10=\"PERU\"),VLOOKUP($K$16,Tablas!$A$296:$H$358,6,TRUE),IF($F10=\"VENEZUELA\",VLOOKUP($K$16,Tablas!$A$441:$H$503,6,TRUE),IF(OR($F10=\"ARGENTINA\",$F10=\"COLOMBIA\",$F10=\"PARAGUAY\"),VLOOKUP($K$16,Tablas!$A$586:$H$648,6,TRUE),0)))))","v":1713},{"$f":"IF(OR($F10=\"CHILE\",$F10=\"HAITI\",$F10=\"HONDURAS\"),VLOOKUP($K$16,Tablas!$A$6:$H$68,7,TRUE),IF(OR($F10=\"COSTA RICA\",$F10=\"EL SALVADOR\"),VLOOKUP($K$16,Tablas!$A$151:$H$213,7,TRUE),IF(OR($F10=\"BELIZE\",$F10=\"GUYANA\",$F10=\"NICARAGUA\",$F10=\"SURINAME\",$F10=\"URUGUAY\",$F10=\"CARIBBEAN\",$F10=\"PERU\"),VLOOKUP($K$16,Tablas!$A$296:$H$358,7,TRUE),IF($F10=\"VENEZUELA\",VLOOKUP($K$16,Tablas!$A$441:$H$503,7,TRUE),IF(OR($F10=\"ARGENTINA\",$F10=\"COLOMBIA\",$F10=\"PARAGUAY\"),VLOOKUP($K$16,Tablas!$A$586:$H$648,7,TRUE),0)))))","v":1558},{"$f":"IF(OR($F10=\"CHILE\",$F10=\"HAITI\",$F10=\"HONDURAS\"),VLOOKUP($K$16,Tablas!$A$6:$H$68,8,TRUE),IF(OR($F10=\"COSTA RICA\",$F10=\"EL SALVADOR\"),VLOOKUP($K$16,Tablas!$A$151:$H$213,8,TRUE),IF(OR($F10=\"BELIZE\",$F10=\"GUYANA\",$F10=\"NICARAGUA\",$F10=\"SURINAME\",$F10=\"URUGUAY\",$F10=\"CARIBBEAN\",$F10=\"PERU\"),VLOOKUP($K$16,Tablas!$A$296:$H$358,8,TRUE),IF($F10=\"VENEZUELA\",VLOOKUP($K$16,Tablas!$A$441:$H$503,8,TRUE),IF(OR($F10=\"ARGENTINA\",$F10=\"COLOMBIA\",$F10=\"PARAGUAY\"),VLOOKUP($K$16,Tablas!$A$586:$H$648,8,TRUE),0)))))","v":1347}]
[null,null,null,"Prima de Cónyuge",null,{"$f":"IF($H$16=1,0,IF(OR($F10=\"CHILE\",$F10=\"HAITI\",$F10=\"HONDURAS\"),VLOOKUP($K$18,Tablas!$A$6:$H$68,3,TRUE),IF(OR($F10=\"COSTA RICA\",$F10=\"EL SALVADOR\"),VLOOKUP($K$18,Tablas!$A$151:$H$213,3,TRUE),IF(OR($F10=\"BELIZE\",$F10=\"GUYANA\",$F10=\"NICARAGUA\",$F10=\"SURINAME\",$F10=\"URUGUAY\",$F10=\"CARIBBEAN\",$F10=\"PERU\"),VLOOKUP($K$18,Tablas!$A$296:$H$358,3,TRUE),IF($F10=\"VENEZUELA\",VLOOKUP($K$18,Tablas!$A$441:$H$503,3,TRUE),IF(OR($F10=\"ARGENTINA\",$F10=\"COLOMBIA\",$F10=\"PARAGUAY\"),VLOOKUP($K$18,Tablas!$A$586:$H$648,3,TRUE),0))))))","v":0},{"$f":"IF($H$16=1,0,IF(OR($F10=\"CHILE\",$F10=\"HAITI\",$F10=\"HONDURAS\"),VLOOKUP($K$18,Tablas!$A$6:$H$68,4,TRUE),IF(OR($F10=\"COSTA RICA\",$F10=\"EL SALVADOR\"),VLOOKUP($K$18,Tablas!$A$151:$H$213,4,TRUE),IF(OR($F10=\"BELIZE\",$F10=\"GUYANA\",$F10=\"NICARAGUA\",$F10=\"SURINAME\",$F10=\"URUGUAY\",$F10=\"CARIBBEAN\",$F10=\"PERU\"),VLOOKUP($K$18,Tablas!$A$296:$H$358,4,TRUE),IF($F10=\"VENEZUELA\",VLOOKUP($K$18,Tablas!$A$441:$H$503,4,TRUE),IF(OR($F10=\"ARGENTINA\",$F10=\"COLOMBIA\",$F10=\"PARAGUAY\"),VLOOKUP($K$18,Tablas!$A$586:$H$648,4,TRUE),0))))))","v":0},{"$f":"IF($H$16=1,0,IF(OR($F10=\"CHILE\",$F10=\"HAITI\",$F10=\"HONDURAS\"),VLOOKUP($K$18,Tablas!$A$6:$H$68,5,TRUE),IF(OR($F10=\"COSTA RICA\",$F10=\"EL SALVADOR\"),VLOOKUP($K$18,Tablas!$A$151:$H$213,5,TRUE),IF(OR($F10=\"BELIZE\",$F10=\"GUYANA\",$F10=\"NICARAGUA\",$F10=\"SURINAME\",$F10=\"URUGUAY\",$F10=\"CARIBBEAN\",$F10=\"PERU\"),VLOOKUP($K$18,Tablas!$A$296:$H$358,5,TRUE),IF($F10=\"VENEZUELA\",VLOOKUP($K$18,Tablas!$A$441:$H$503,5,TRUE),IF(OR($F10=\"ARGENTINA\",$F10=\"COLOMBIA\",$F10=\"PARAGUAY\"),VLOOKUP($K$18,Tablas!$A$586:$H$648,5,TRUE),0))))))","v":0},{"$f":"IF($H$16=1,0,IF(OR($F10=\"CHILE\",$F10=\"HAITI\",$F10=\"HONDURAS\"),VLOOKUP($K$18,Tablas!$A$6:$H$68,6,TRUE),IF(OR($F10=\"COSTA RICA\",$F10=\"EL SALVADOR\"),VLOOKUP($K$18,Tablas!$A$151:$H$213,6,TRUE),IF(OR($F10=\"BELIZE\",$F10=\"GUYANA\",$F10=\"NICARAGUA\",$F10=\"SURINAME\",$F10=\"URUGUAY\",$F10=\"CARIBBEAN\",$F10=\"PERU\"),VLOOKUP($K$18,Tablas!$A$296:$H$358,6,TRUE),IF($F10=\"VENEZUELA\",VLOOKUP($K$18,Tablas!$A$441:$H$503,6,TRUE),IF(OR($F10=\"ARGENTINA\",$F10=\"COLOMBIA\",$F10=\"PARAGUAY\"),VLOOKUP($K$18,Tablas!$A$586:$H$648,6,TRUE),0))))))","v":0},{"$f":"IF($H$16=1,0,IF(OR($F10=\"CHILE\",$F10=\"HAITI\",$F10=\"HONDURAS\"),VLOOKUP($K$18,Tablas!$A$6:$H$68,7,TRUE),IF(OR($F10=\"COSTA RICA\",$F10=\"EL SALVADOR\"),VLOOKUP($K$18,Tablas!$A$151:$H$213,7,TRUE),IF(OR($F10=\"BELIZE\",$F10=\"GUYANA\",$F10=\"NICARAGUA\",$F10=\"SURINAME\",$F10=\"URUGUAY\",$F10=\"CARIBBEAN\",$F10=\"PERU\"),VLOOKUP($K$18,Tablas!$A$296:$H$358,7,TRUE),IF($F10=\"VENEZUELA\",VLOOKUP($K$18,Tablas!$A$441:$H$503,7,TRUE),IF(OR($F10=\"ARGENTINA\",$F10=\"COLOMBIA\",$F10=\"PARAGUAY\"),VLOOKUP($K$18,Tablas!$A$586:$H$648,7,TRUE),0))))))","v":0},{"$f":"IF($H$16=1,0,IF(OR($F10=\"CHILE\",$F10=\"HAITI\",$F10=\"HONDURAS\"),VLOOKUP($K$18,Tablas!$A$6:$H$68,8,TRUE),IF(OR($F10=\"COSTA RICA\",$F10=\"EL SALVADOR\"),VLOOKUP($K$18,Tablas!$A$151:$H$213,8,TRUE),IF(OR($F10=\"BELIZE\",$F10=\"GUYANA\",$F10=\"NICARAGUA\",$F10=\"SURINAME\",$F10=\"URUGUAY\",$F10=\"CARIBBEAN\",$F10=\"PERU\"),VLOOKUP($K$18,Tablas!$A$296:$H$358,8,TRUE),IF($F10=\"VENEZUELA\",VLOOKUP($K$18,Tablas!$A$441:$H$503,8,TRUE),IF(OR($F10=\"ARGENTINA\",$F10=\"COLOMBIA\",$F10=\"PARAGUAY\"),VLOOKUP($K$18,Tablas!$A$586:$H$648,8,TRUE),0))))))","v":0}]
[null,null,null,"Primas Hijos :",null,{"$f":"IF($H$18=0,0,IF(OR($F10=\"CHILE\",$F10=\"HAITI\",$F10=\"HONDURAS\"),VLOOKUP($H$18,Tablas!$A$69:$H$71,3,TRUE),IF(OR($F10=\"COSTA RICA\",$F10=\"EL SALVADOR\"),VLOOKUP($H$18,Tablas!$A$214:$H$216,3,TRUE),IF(OR($F10=\"BELIZE\",$F10=\"GUYANA\",$F10=\"NICARAGUA\",$F10=\"SURINAME\",$F10=\"URUGUAY\",$F10=\"CARIBBEAN\",$F10=\"PERU\"),VLOOKUP($H$18,Tablas!$A$359:$H$361,3,TRUE),IF($F10=\"VENEZUELA\",VLOOKUP($H$18,Tablas!$A$504:$H$506,3,TRUE),IF(OR($F10=\"ARGENTINA\",$F10=\"COLOMBIA\",$F10=\"PARAGUAY\"),VLOOKUP($H$18,Tablas!$A$649:$H$651,3,TRUE),0))))))","v":0},{"$f":"IF($H$18=0,0,IF(OR($F10=\"CHILE\",$F10=\"HAITI\",$F10=\"HONDURAS\"),VLOOKUP($H$18,Tablas!$A$69:$H$71,4,TRUE),IF(OR($F10=\"COSTA RICA\",$F10=\"EL SALVADOR\"),VLOOKUP($H$18,Tablas!$A$214:$H$216,4,TRUE),IF(OR($F10=\"BELIZE\",$F10=\"GUYANA\",$F10=\"NICARAGUA\",$F10=\"SURINAME\",$F10=\"URUGUAY\",$F10=\"CARIBBEAN\",$F10=\"PERU\"),VLOOKUP($H$18,Tablas!$A$359:$H$361,4,TRUE),IF($F10=\"VENEZUELA\",VLOOKUP($H$18,Tablas!$A$504:$H$506,4,TRUE),IF(OR($F10=\"ARGENTINA\",$F10=\"COLOMBIA\",$F10=\"PARAGUAY\"),VLOOKUP($H$18,Tablas!$A$649:$H$651,4,TRUE),0))))))","v":0},{"$f":"IF($H$18=0,0,IF(OR($F10=\"CHILE\",$F10=\"HAITI\",$F10=\"HONDURAS\"),VLOOKUP($H$18,Tablas!$A$69:$H$71,5,TRUE),IF(OR($F10=\"COSTA RICA\",$F10=\"EL SALVADOR\"),VLOOKUP($H$18,Tablas!$A$214:$H$216,5,TRUE),IF(OR($F10=\"BELIZE\",$F10=\"GUYANA\",$F10=\"NICARAGUA\",$F10=\"SURINAME\",$F10=\"URUGUAY\",$F10=\"CARIBBEAN\",$F10=\"PERU\"),VLOOKUP($H$18,Tablas!$A$359:$H$361,5,TRUE),IF($F10=\"VENEZUELA\",VLOOKUP($H$18,Tablas!$A$504:$H$506,5,TRUE),IF(OR($F10=\"ARGENTINA\",$F10=\"COLOMBIA\",$F10=\"PARAGUAY\"),VLOOKUP($H$18,Tablas!$A$649:$H$651,5,TRUE),0))))))","v":0},{"$f":"IF($H$18=0,0,IF(OR($F10=\"CHILE\",$F10=\"HAITI\",$F10=\"HONDURAS\"),VLOOKUP($H$18,Tablas!$A$69:$H$71,6,TRUE),IF(OR($F10=\"COSTA RICA\",$F10=\"EL SALVADOR\"),VLOOKUP($H$18,Tablas!$A$214:$H$216,6,TRUE),IF(OR($F10=\"BELIZE\",$F10=\"GUYANA\",$F10=\"NICARAGUA\",$F10=\"SURINAME\",$F10=\"URUGUAY\",$F10=\"CARIBBEAN\",$F10=\"PERU\"),VLOOKUP($H$18,Tablas!$A$359:$H$361,6,TRUE),IF($F10=\"VENEZUELA\",VLOOKUP($H$18,Tablas!$A$504:$H$506,6,TRUE),IF(OR($F10=\"ARGENTINA\",$F10=\"COLOMBIA\",$F10=\"PARAGUAY\"),VLOOKUP($H$18,Tablas!$A$649:$H$651,6,TRUE),0))))))","v":0},{"$f":"IF($H$18=0,0,IF(OR($F10=\"CHILE\",$F10=\"HAITI\",$F10=\"HONDURAS\"),VLOOKUP($H$18,Tablas!$A$69:$H$71,7,TRUE),IF(OR($F10=\"COSTA RICA\",$F10=\"EL SALVADOR\"),VLOOKUP($H$18,Tablas!$A$214:$H$216,7,TRUE),IF(OR($F10=\"BELIZE\",$F10=\"GUYANA\",$F10=\"NICARAGUA\",$F10=\"SURINAME\",$F10=\"URUGUAY\",$F10=\"CARIBBEAN\",$F10=\"PERU\"),VLOOKUP($H$18,Tablas!$A$359:$H$361,7,TRUE),IF($F10=\"VENEZUELA\",VLOOKUP($H$18,Tablas!$A$504:$H$506,7,TRUE),IF(OR($F10=\"ARGENTINA\",$F10=\"COLOMBIA\",$F10=\"PARAGUAY\"),VLOOKUP($H$18,Tablas!$A$649:$H$651,7,TRUE),0))))))","v":0},{"$f":"IF($H$18=0,0,IF(OR($F10=\"CHILE\",$F10=\"HAITI\",$F10=\"HONDURAS\"),VLOOKUP($H$18,Tablas!$A$69:$H$71,8,TRUE),IF(OR($F10=\"COSTA RICA\",$F10=\"EL SALVADOR\"),VLOOKUP($H$18,Tablas!$A$214:$H$216,8,TRUE),IF(OR($F10=\"BELIZE\",$F10=\"GUYANA\",$F10=\"NICARAGUA\",$F10=\"SURINAME\",$F10=\"URUGUAY\",$F10=\"CARIBBEAN\",$F10=\"PERU\"),VLOOKUP($H$18,Tablas!$A$359:$H$361,8,TRUE),IF($F10=\"VENEZUELA\",VLOOKUP($H$18,Tablas!$A$504:$H$506,8,TRUE),IF(OR($F10=\"ARGENTINA\",$F10=\"COLOMBIA\",$F10=\"PARAGUAY\"),VLOOKUP($H$18,Tablas!$A$649:$H$651,8,TRUE),0))))))","v":0}]
[null,null,null,"Prima Rider Complic. Maternidad",null,0,0,0,0,0,0]
[null,null,null,"Prima Rider Trasplante Organos",null,0,0,0,0,0,0]
[null,null,null,"TOTAL PRIMA NETA :",null,{"$f":"SUM(F24:F28)","v":2864},{"$f":"SUM(G24:G28)","v":2605},2021,1713,1558,1347]
[null,null,null,"Costo Administrativo Anual :",null,75,75,75,75,75,75]
{"$rows_left_out":15}
{"sheet":"Tablas","index":2,"n_rows":725,"n_cols":19,"rows_kept":725,"cut":false,"hidden":true,"merged":[[655,0,655,1],[655,2,655,6],[581,0,581,7],[582,0,582,7],[583,0,583,1],[583,2,583,6],[654,0,654,7],[438,0,438,1],[438,2,438,6],[509,0,509,7],[510,0,510,1],[510,2,510,6],[364,0,364,7],[365,0,365,1],[365,2,365,6],[436,0,436,7],[437,0,437,7],[220,0,220,1],[220,2,220,6],[291,0,291,7],[292,0,292,7],[293,0,293,1],[293,2,293,6],[146,0,146,7],[147,0,147,7],[148,0,148,1],[148,2,148,6],[219,0,219,7],[1,0,1,7],[2,0,2,7],[75,0,75,1],[75,2,75,6],[74,0,74,7],[3,0,3,1],[3,2,3,6]]}
[]
["BUPA FLEX - ZONE 2",null,null,null,null,null,null,null,null,"FACTOR SEMESTRAL :",null,0.53,null,"PAISES"]
["TARIFAS ANUALES",null,null,null,null,null,null,null,null,null,null,null,null,"ARGENTINA",6]
["EDAD",null,null,null,null,null,null,null,null,null,null,null,null,"BELIZE",4]
[" "," ",null,"DW2","DW3","DW4","DW5","DW6",null,null,null,null,null,"CARIBBEAN",4]
[18,null,3901,3546,2744,2327,2115,1834,null,true,true,true,null,"CHILE",2,null,true,true,true]
[19,null,3968,3608,2803,2373,2158,1869,null,true,true,true,null,"COLOMBIA",6,null,true,true,true]
[20,null,4038,3668,2864,2418,2201,1905,null,true,true,true,null,"COSTA RICA",3,null,true,true,true]
[21,null,4101,3730,2924,2466,2242,1941,null,true,true,true,null,"EL SALVADOR",3,null,true,true,true]
[22,null,4180,3795,2987,2515,2285,1980,null,true,true,true,null,"GUYANA",4,null,true,true,true]
[23,null,4245,3861,3045,2561,2327,2018,null,true,true,true,null,"HAITI",2,null,true,true,true]
[24,null,4317,3924,3111,2608,2373,2058,null,true,true,true,null,"HONDURAS",2,null,true,true,true]
[25,null,4388,3991,3170,2655,2415,2094,null,true,true,true,null,"NICARAGUA",4,null,true,true,true]
[26,null,4457,4052,3232,2702,2457,2131,null,true,true,true,null,"PARAGUAY",6,null,true,true,true]
[27,null,4529,4115,3295,2750,2504,2170,null,true,true,true,null,"PERU",4,null,true,true,true]
[28,null,4605,4187,3374,2806,2555,2212,null,true,true,true,null,"SURINAME",4,null,true,true,true]
[29,null,4686,4262,3449,2865,2606,2258,null,true,true,true,null,"URUGUAY",4,null,true,true,true]
[30,null,4764,4332,3528,2924,2655,2303,null,true,true,true,null,"VENEZUELA",5,null,true,true,true]
[31,null,4843,4404,3604,2978,2709,2347,null,true,true,true,null,null,null,null,true,true,true]
[32,null,4922,4474,3681,3038,2760,2392,null,true,true,true,null,null,null,null,true,true,true]
[33,null,5055,4600,3797,3127,2842,2462,null,true,true,true,null,null,null,null,true,true,true]
[34,null,5193,4720,3911,3217,2925,2533,null,true,true,true,null,null,null,null,true,true,true]
[35,null,5330,4844,4026,3307,3011,2602,null,true,true,true,null,null,null,null,true,true,true]
[36,null,5465,4971,4145,3399,3094,2665,null,true,true,true,null,null,null,null,true,true,true]
[37,null,5602,5092,4259,3492,3174,2737,null,true,true,true,null,null,null,null,true,true,true]
[38,null,5737,5218,4378,3583,3256,2816,null,true,true,true,null,null,null,null,true,true,true]
[39,null,5873,5340,4497,3676,3343,2887,null,true,true,true,null,null,null,null,true,true,true]
[40,null,6011,5465,4617,3765,3422,2957,null,true,true,true,null,null,null,null,true,true,true]
[41,null,6146,5585,4734,3855,3506,3030,null,true,true,true,null,null,null,null,true,true,true]
[42,null,6283,5710,4853,3948,3589,3101,null,true,true,true,null,null,null,null,true,true,true]
{"$rows_left_out":695}