{"text_format":"1","workbook":"xlsx","n_sheets":8,"sheets":["INGRESO DE DATOS","Global Ultimate","Global Elite","Global Premier","Global Select","Global Major Medical","Resumen tarifas","Tablas"],"not_rendered":{"charts":0,"images":19,"macros":1,"external_links":0,"defined_names":7,"comments":1,"pivot_tables":0},"unopened":[],"bounds":{"document_bytes":16777216,"sheet_cells":100000,"rows_first":2000,"rows_last":500,"rows_between":2000,"halvings":0,"cell_chars":16384,"cell_head_chars":4096},"cells_cut":0,"cells_raw":0,"read":"whole","date_system":"1900"}

{"sheet":"INGRESO DE DATOS","index":0,"n_rows":50,"n_cols":9,"rows_kept":50,"cut":false,"hidden":false,"merged":[[17,0,17,9],[47,3,47,4],[47,6,47,7],[24,5,24,6],[20,1,20,2],[22,1,22,2],[20,3,20,7],[22,5,22,6],[24,1,24,2]]}
[]
[null,null,null,null,null,null,null," "," "]
[]
[]
[]
[]
[]
[]
[]
[null,null,null,null,null,null,null," "," "]
[]
[]
[]
[]
[]
[]
[]
[" Tarifas efectivas a partir del 1ro de enero de 2021 — Para renovaciones de pólizas emitidas antes del 1 de abril de 2018"]
["1.   LLENE LA INFORMACIÓN DEL ASEGURADO PROPUESTO:"]
[]
[null,"Nombre del Asegurado Titular",null,"NOMBRE COMPLETO"]
[]
[null,"Número de adultos en la póliza",null,1,null,"Número de niños en la póliza",null,0]
[]
[null,"Edad del Asegurado Titular",null,35,null,"Edad del/la cónyuge ",null,46]
[]
[null,null,null,null,null,null,"Variante con coaseguro fuera del país de residencia",true]
[]
["2.   SELECCIONE EL PRODUCTO PARA VER LA COTIZACIÓN CORRESPONDIENTE: "]
[]
[]
[]
[]
[]
[]
[]
[]
[]
[]
[]
{"$rows_left_out":11}
{"sheet":"Global Ultimate","index":1,"n_rows":84,"n_cols":10,"rows_kept":84,"cut":false,"hidden":false,"merged":[[48,0,49,0],[48,1,49,1],[56,4,56,5],[62,4,62,5],[24,0,24,1],[24,3,24,4],[24,5,24,8],[26,3,26,4],[28,3,28,4],[30,3,31,4],[80,4,80,5],[83,4,85,7],[82,4,82,7],[68,4,68,5],[44,4,44,5],[63,4,63,5],[81,4,81,7],[74,4,74,5],[75,4,75,5]]}
[]
[]
[null,null,null,null,null,null,null," "," "," "]
[]
[]
[]
[null,null,null,null,null,null,null," "," "," "]
[]
[]
[]
[]
[]
[]
[]
[]
[]
[]
[]
[]
[]
[]
[]
[]
[]
["GLOBAL ULTIMATE HEALTH PLAN",null,null,"Nombre del Asegurado Titular",null,{"$f":"+'INGRESO DE DATOS'!$D$21","v":"NOMBRE COMPLETO"}]
[]
[null,null,null,"Número de adultos en la póliza",null,{"$f":"+'INGRESO DE DATOS'!$D$23","v":1},null,"Edad del Asegurado Titular",{"$f":"+'INGRESO DE DATOS'!$D$25","v":35}]
[]
[null,null,null,"Número de niños en la póliza",null,{"$f":"+'INGRESO DE DATOS'!$H$23","v":0},null,"Edad del/la conyuge",{"$f":"+'INGRESO DE DATOS'!$H$25","v":46}]
[null,null,null,null,null,null,null," "," "]
[null,null,null,"Número de niños menores de 16 años",null,{"$f":"+'INGRESO DE DATOS'!$B$50","v":1},"Fecha de la cotización:",{"$f":"NOW()","v":"2021-11-08T11:55:45.700"}]
[null,null,null,null,null,null," ",false,null," "]
[null,null,null,null,"Deducibles",null,"PLAN 1","PLAN 2"]
[null,null,null,null,"En el país de residencia",null,0,1000]
[null,null,null,null,"Fuera del país de residencia",null,0,1000]
[]
[null,null,null,null,"Tarifas anuales"]
[null,null,null,null,"Prima para Asegurado Titular",null,{"$f":"(VLOOKUP($I$27,Tablas!$A$905:$G$971,3,TRUE))*0.9","v":19322.100000000002},{"$f":"(VLOOKUP($I$27,Tablas!$A$905:$G$971,4,TRUE))*0.9","v":12466.800000000001}]
[null,null,null,null,"Prima para conyuge",null,{"$f":"(IF($F$27=1,0,(VLOOKUP($I$29,Tablas!$A$905:$G$971,3,TRUE))))*0.9","v":0},{"$f":"(IF($F$27=1,0,(VLOOKUP($I$29,Tablas!$A$905:$G$971,4,TRUE))))*0.9","v":0}]
[null,null,null,null,"Prima para hijo (s)",null,{"$f":"(IF($F$27=1,\n(IF($F$29=0, 0,\n (IF($F$31>$F$29, (VLOOKUP($F$29,Tablas!$A$972:$G$974,3,TRUE)),\n(IF($F$29>4,(IF($F$31=0, (VLOOKUP(3,Tablas!$A$972:$G$974,3,TRUE)),\n(IF($F$31=1, (VLOOKUP(3,Tablas!$A$972:$G$974,3,TRUE)),\n(IF($F$31=2, (VLOOKUP(3,Tablas!$A$972:$G$974,3,TRUE)),\n(VLOOKUP(3,Tablas!$A$972:$G$974,3,TRUE)))))))),\n(IF($F$29=4,(IF(4-$F$31=0,(VLOOKUP(2,Tablas!$A$972:$G$974,3,TRUE)),\n(IF(4-$F$31=1,(VLOOKUP(2,Tablas!$A$972:$G$974,3,TRUE)),\n(IF(4-$F$31=2, (VLOOKUP(2,Tablas!$A$972:$G$974,3,TRUE)),\n(VLOOKUP(3,Tablas!$A$972:$G$974,3,TRUE)))))))),\n(IF($F$29=3,(IF(3-$F$31=0,(VLOOKUP(1,Tablas!$A$972:$G$974,3,TRUE)),\n(IF(3-$F$31=1,(VLOOKUP(1,Tablas!$A$972:$G$974,3,TRUE)),\n(IF(3-$F$31=2, (VLOOKUP(2,Tablas!$A$972:$G$974,3,TRUE)),\n(VLOOKUP(3,Tablas!$A$972:$G$974,3,TRUE)))))))),\n\n(IF($F$29=2,(IF(2-$F$31=0, 0,\n(IF(2-$F$31=1,(VLOOKUP(1,Tablas!$A$972:$G$974,3,TRUE)),\n(IF(2-$F$31=2, (VLOOKUP(2,Tablas!$A$972:$G$974,3,TRUE)),\n         0)))))),\n(IF($F$29=1,(IF(1-$F$31=0, 0,\n(IF(1-$F$31=1,(VLOOKUP(1,Tablas!$A$972:$G$974,3,TRUE)),0)))),0)))))))))))))),\n(IF($F$29=0, 0,\n (IF($F$31>$F$29, (VLOOKUP($F$29,Tablas!$A$972:$G$974,3,TRUE)),\n(IF($F$29=4,(IF(4-$F$31=0, 0,\n(IF(4-$F$31=1, (VLOOKUP(1,Tablas!$A$972:$G$974,3,TRUE)),\n(IF(4-$F$31=2, (VLOOKUP(2,Tablas!$A$972:$G$974,3,TRUE)),\n(IF(4-$F$31=3, (VLOOKUP(3,Tablas!$A$972:$G$974,3,TRUE)),\n(IF(4-$F$31=4, (VLOOKUP(3,Tablas!$A$972:$G$974,3,TRUE)),\n0)))))))))),\n(IF($F$29=5,(IF(5-$F$31=0, (VLOOKUP(1,Tablas!$A$972:$G$974,3,TRUE)),\n(IF(5-$F$31=1, (VLOOKUP(1,Tablas!$A$972:$G$974,3,TRUE)),\n(IF(5-$F$31=2, (VLOOKUP(2,Tablas!$A$972:$G$974,3,TRUE)),\n(IF(5-$F$31=3, (VLOOKUP(3,Tablas!$A$972:$G$974,3,TRUE)),\n(IF(5-$F$31=4, (VLOOKUP(3,Tablas!$A$972:$G$974,3,TRUE)),\n(VLOOKUP(3,Tablas!$A$972:$G$974,3,TRUE)))))))))))),\n(IF($F$29=6,(IF(6-$F$31=0, (VLOOKUP(2,Tablas!$A$972:$G$974,3,TRUE)),\n(IF(6-$F$31=1, (VLOOKUP(2,Tablas!$A$972:$G$974,3,TRUE)),\n(IF(6-$F$31=2, (VLOOKUP(2,Tablas!$A$972:$G$974,3,TRUE)),\n(IF(6-$F$31=3, (VLOOKUP(3,Tablas!$A$972:$G$974,3,TRUE)),\n(IF(6-$F$31=4, (VLOOKUP(3,Tablas!$A$972:$G$974,3,TRUE)),\n(VLOOKUP(3,Tablas!$A$972:$G$974,3,TRUE)))))))))))),\n(IF($F$29>6,(IF(7-$F$31=0, (VLOOKUP(3,Tablas!$A$972:$G$974,3,TRUE)),\n(IF(7-$F$31=1, (VLOOKUP(3,Tablas!$A$972:$G$974,3,TRUE)),\n(IF(7-$F$31=2, (VLOOKUP(3,Tablas!$A$972:$G$974,3,TRUE)),\n(IF(7-$F$31=3, (VLOOKUP(3,Tablas!$A$972:$G$974,3,TRUE)),\n(IF(7-$F$31=4, (VLOOKUP(3,Tablas!$A$972:$G$974,3,TRUE)),\n(VLOOKUP(3,Tablas!$A$972:$G$974,3,TRUE)))))))))))),\n\n(IF($F$29=3,(IF(3-$F$31=0,0,\n(IF(3-$F$31=1,(VLOOKUP(1,Tablas!$A$972:$G$974,3,TRUE)),\n(IF(3-$F$31=2, (VLOOKUP(2,Tablas!$A$972:$G$974,3,TRUE)),\n(VLOOKUP(3,Tablas!$A$972:$G$974,3,TRUE)))))))),\n\n(IF($F$29=2,(IF(2-$F$31=0, 0,\n(IF(2-$F$31=1,(VLOOKUP(1,Tablas!$A$972:$G$974,3,TRUE)),\n(IF(2-$F$31=2, (VLOOKUP(2,Tablas!$A$972:$G$974,3,TRUE)),\n         0)))))),\n(IF($F$29=1,(IF(1-$F$31=0, 0,\n(IF(1-$F$31=1,(VLOOKUP(1,Tablas!$A$972:$G$974,3,TRUE)),0)))),0))))))))))))))))))))*0.9","v":0},{"$f":"(IF($F$27=1,\n(IF($F$29=0, 0,\n (IF($F$31>$F$29, (VLOOKUP($F$29,Tablas!$A$972:$G$974,4,TRUE)),\n(IF($F$29>4,(IF($F$31=0, (VLOOKUP(3,Tablas!$A$972:$G$974,4,TRUE)),\n(IF($F$31=1, (VLOOKUP(3,Tablas!$A$972:$G$974,4,TRUE)),\n(IF($F$31=2, (VLOOKUP(3,Tablas!$A$972:$G$974,4,TRUE)),\n(VLOOKUP(3,Tablas!$A$972:$G$974,4,TRUE)))))))),\n(IF($F$29=4,(IF(4-$F$31=0,(VLOOKUP(2,Tablas!$A$972:$G$974,4,TRUE)),\n(IF(4-$F$31=1,(VLOOKUP(2,Tablas!$A$972:$G$974,4,TRUE)),\n(IF(4-$F$31=2, (VLOOKUP(2,Tablas!$A$972:$G$974,4,TRUE)),\n(VLOOKUP(3,Tablas!$A$972:$G$974,4,TRUE)))))))),\n(IF($F$29=3,(IF(3-$F$31=0,(VLOOKUP(1,Tablas!$A$972:$G$974,4,TRUE)),\n(IF(3-$F$31=1,(VLOOKUP(1,Tablas!$A$972:$G$974,4,TRUE)),\n(IF(3-$F$31=2, (VLOOKUP(2,Tablas!$A$972:$G$974,4,TRUE)),\n(VLOOKUP(3,Tablas!$A$972:$G$974,4,TRUE)))))))),\n\n(IF($F$29=2,(IF(2-$F$31=0, 0,\n(IF(2-$F$31=1,(VLOOKUP(1,Tablas!$A$972:$G$974,4,TRUE)),\n(IF(2-$F$31=2, (VLOOKUP(2,Tablas!$A$972:$G$974,4,TRUE)),\n         0)))))),\n(IF($F$29=1,(IF(1-$F$31=0, 0,\n(IF(1-$F$31=1,(VLOOKUP(1,Tablas!$A$972:$G$974,4,TRUE)),0)))),0)))))))))))))),\n(IF($F$29=0, 0,\n (IF($F$31>$F$29, (VLOOKUP($F$29,Tablas!$A$972:$G$974,4,TRUE)),\n(IF($F$29=4,(IF(4-$F$31=0, 0,\n(IF(4-$F$31=1, (VLOOKUP(1,Tablas!$A$972:$G$974,4,TRUE)),\n(IF(4-$F$31=2, (VLOOKUP(2,Tablas!$A$972:$G$974,4,TRUE)),\n(IF(4-$F$31=3, (VLOOKUP(3,Tablas!$A$972:$G$974,4,TRUE)),\n(IF(4-$F$31=4, (VLOOKUP(3,Tablas!$A$972:$G$974,4,TRUE)),\n0)))))))))),\n(IF($F$29=5,(IF(5-$F$31=0, (VLOOKUP(1,Tablas!$A$972:$G$974,4,TRUE)),\n(IF(5-$F$31=1, (VLOOKUP(1,Tablas!$A$972:$G$974,4,TRUE)),\n(IF(5-$F$31=2, (VLOOKUP(2,Tablas!$A$972:$G$974,4,TRUE)),\n(IF(5-$F$31=3, (VLOOKUP(3,Tablas!$A$972:$G$974,4,TRUE)),\n(IF(5-$F$31=4, (VLOOKUP(3,Tablas!$A$972:$G$974,4,TRUE)),\n(VLOOKUP(3,Tablas!$A$972:$G$974,4,TRUE)))))))))))),\n(IF($F$29=6,(IF(6-$F$31=0, (VLOOKUP(2,Tablas!$A$972:$G$974,4,TRUE)),\n(IF(6-$F$31=1, (VLOOKUP(2,Tablas!$A$972:$G$974,4,TRUE)),\n(IF(6-$F$31=2, (VLOOKUP(2,Tablas!$A$972:$G$974,4,TRUE)),\n(IF(6-$F$31=3, (VLOOKUP(3,Tablas!$A$972:$G$974,4,TRUE)),\n(IF(6-$F$31=4, (VLOOKUP(3,Tablas!$A$972:$G$974,4,TRUE)),\n(VLOOKUP(3,Tablas!$A$972:$G$974,4,TRUE)))))))))))),\n(IF($F$29>6,(IF(7-$F$31=0, (VLOOKUP(3,Tablas!$A$972:$G$974,4,TRUE)),\n(IF(7-$F$31=1, (VLOOKUP(3,Tablas!$A$972:$G$974,4,TRUE)),\n(IF(7-$F$31=2, (VLOOKUP(3,Tablas!$A$972:$G$974,4,TRUE)),\n(IF(7-$F$31=3, (VLOOKUP(3,Tablas!$A$972:$G$974,4,TRUE)),\n(IF(7-$F$31=4, (VLOOKUP(3,Tablas!$A$972:$G$974,4,TRUE)),\n(VLOOKUP(3,Tablas!$A$972:$G$974,4,TRUE)))))))))))),\n\n(IF($F$29=3,(IF(3-$F$31=0,0,\n(IF(3-$F$31=1,(VLOOKUP(1,Tablas!$A$972:$G$974,4,TRUE)),\n(IF(3-$F$31=2, (VLOOKUP(2,Tablas!$A$972:$G$974,4,TRUE)),\n(VLOOKUP(3,Tablas!$A$972:$G$974,4,TRUE)))))))),\n\n(IF($F$29=2,(IF(2-$F$31=0, 0,\n(IF(2-$F$31=1,(VLOOKUP(1,Tablas!$A$972:$G$974,4,TRUE)),\n(IF(2-$F$31=2, (VLOOKUP(2,Tablas!$A$972:$G$974,4,TRUE)),\n         0)))))),\n(IF($F$29=1,(IF(1-$F$31=0, 0,\n(IF(1-$F$31=1,(VLOOKUP(1,Tablas!$A$972:$G$974,4,TRUE)),0)))),0))))))))))))))))))))*0.9","v":0}]
{"$rows_left_out":45}
{"sheet":"Global Elite","index":2,"n_rows":97,"n_cols":11,"rows_kept":97,"cut":false,"hidden":false,"merged":[[96,4,97,10],[69,8,69,10],[94,4,94,10],[54,4,54,5],[67,4,67,5],[80,4,80,5],[73,4,73,5],[75,4,75,5],[95,4,95,10],[61,4,61,5],[74,4,74,5],[82,8,82,10],[86,4,86,5],[87,4,87,5],[88,4,88,5],[93,4,93,5],[45,8,45,10],[56,8,56,10],[33,5,33,10],[41,4,41,5],[39,3,40,4],[50,4,50,5],[62,1,63,1],[62,0,63,0],[37,3,37,4],[33,3,33,4],[35,3,35,4],[33,0,33,1]]}
[]
[]
[null,null,null,null,null,null,null," "," "," "]
[]
[]
[]
[null,null,null,null,null,null,null," "," "," "]
[]
[]
[]
[]
[]
[]
[]
[]
[]
[]
[]
[]
[]
[]
[]
[]
[]
[]
[]
[]
[]
[]
[]
[]
[]
[]
["GLOBAL ELITE HEALTH PLAN",null,null,"Nombre del Asegurado Titular",null,{"$f":"+'INGRESO DE DATOS'!$D$21","v":"NOMBRE COMPLETO"}]
[]
[null,null,null,"Número de adultos en la póliza",null,{"$f":"+'INGRESO DE DATOS'!$D$23","v":1},null,"Edad del Asegurado Titular",{"$f":"+'INGRESO DE DATOS'!$D$25","v":35}]
[]
[null,null,null,"Número de niños en la póliza",null,{"$f":"+'INGRESO DE DATOS'!$H$23","v":0},null,"Edad del/la conyuge",{"$f":"+'INGRESO DE DATOS'!$H$25","v":46}]
[null,null,null,null,null,null,null," "," "]
[null,null,null,"Número de niños menores de 10 años",null,{"$f":"+'INGRESO DE DATOS'!$D$50","v":1},"Fecha de la cotización:",{"$f":"NOW()","v":"2021-11-08T11:55:45.700"}]
{"$rows_left_out":58}
{"sheet":"Global Premier","index":3,"n_rows":91,"n_cols":10,"rows_kept":91,"cut":false,"hidden":false,"merged":[[53,8,53,9],[65,8,65,9],[89,4,89,9],[88,4,88,9],[90,4,91,9],[63,4,63,5],[58,4,58,5],[70,4,70,5],[77,8,77,9],[81,4,81,5],[82,4,82,5],[83,4,83,5],[60,1,61,1],[60,0,61,0],[31,0,31,1],[69,4,69,5],[71,4,71,5],[37,5,37,6],[48,4,48,5],[37,7,37,8],[31,3,31,4],[33,3,33,4],[35,3,35,4],[31,5,31,8]]}
[]
[]
[null,null,null,null,null,null,null," "," "," "]
[]
[]
[]
[]
[]
[]
[]
[]
[]
[]
[]
[]
[]
[]
[null,null,null,null,null,null,null," "," "," "]
[]
[]
[]
[]
[]
[]
[]
[]
[]
[]
[]
[]
[]
["GLOBAL PREMIER HEALTH PLAN",null,null,"Nombre del Asegurado Titular",null,{"$f":"+'INGRESO DE DATOS'!$D$21","v":"NOMBRE COMPLETO"}]
[]
[null,null,null,"Número de adultos en la póliza",null,{"$f":"+'INGRESO DE DATOS'!$D$23","v":1},null,"Edad del Asegurado Titular",{"$f":"+'INGRESO DE DATOS'!$D$25","v":35}]
[]
[null,null,null,"Número de niños en la póliza",null,{"$f":"+'INGRESO DE DATOS'!$H$23","v":0},null,"Edad del/la conyuge",{"$f":"+'INGRESO DE DATOS'!$H$25","v":46}]
[null,null,null,null,null,null,null," "," "]
[null,null,null,null,null,"Fecha de la cotización:",null,{"$f":"NOW()","v":"2021-11-08T11:55:45.700"}]
[null,null,null,null,null,null," ",false,null," "]
[null,null,null,null,"Deducibles",null,"PLAN 1","PLAN 2","PLAN 3","PLAN 4"]
{"$rows_left_out":52}
{"sheet":"Global Select","index":4,"n_rows":88,"n_cols":10,"rows_kept":88,"cut":false,"hidden":false,"merged":[[87,4,88,9],[40,8,40,9],[50,8,50,9],[62,8,62,9],[86,4,86,9],[85,4,85,9],[45,4,45,5],[55,4,55,5],[67,4,67,5],[60,4,60,5],[72,4,72,5],[48,4,48,5],[74,8,74,9],[78,4,78,5],[79,4,79,5],[80,4,80,5],[28,0,28,1],[57,0,58,0],[33,3,33,4],[66,4,66,5],[68,4,68,5],[57,1,58,1],[34,5,34,6],[84,4,84,5],[34,7,34,8],[28,3,28,4],[30,3,30,4],[28,5,28,8]]}
[]
[]
[null,null,null,null,null,null,null," "," "," "]
[]
[]
[]
[null,null,null,null,null,null,null," "," "," "]
[]
[]
[]
[]
[]
[]
[]
[]
[]
[]
[]
[]
[]
[]
[]
[]
[]
[]
[]
[]
[]
["GLOBAL SELECT HEALTH PLAN",null,null,"Nombre del Asegurado Titular",null,{"$f":"+'INGRESO DE DATOS'!$D$21","v":"NOMBRE COMPLETO"}]
[]
[null,null,null,"Número de adultos en la póliza",null,{"$f":"+'INGRESO DE DATOS'!$D$23","v":1},null,"Edad del Asegurado Titular",{"$f":"+'INGRESO DE DATOS'!$D$25","v":35}]
[]
[null,null,null,null,null,null,null,"Edad del/la conyuge",{"$f":"+'INGRESO DE DATOS'!$H$25","v":46}]
[null,null,null,"Número de niños en la póliza",null,{"$f":"+'INGRESO DE DATOS'!$H$23","v":0},null," "," "]
[null,null,null,null,null,"Fecha de la cotización:",null,{"$f":"NOW()","v":"2021-11-08T11:55:45.700"}]
[null,null,null,null,null,null," ",false,null," "]
[null,null,null,null,"Deducibles",null,"PLAN 1","PLAN 2","PLAN 3","PLAN 4"]
[null,null,null,null,"En el país de residencia",null,250,2000,5000,10000]
[null,null,null,null,"Fuera del país de residencia",null,5000,2000,5000,10000]
[]
{"$rows_left_out":49}
{"sheet":"Global Major Medical","index":5,"n_rows":86,"n_cols":10,"rows_kept":86,"cut":false,"hidden":false,"merged":[[34,3,34,4],[30,3,30,4],[30,5,30,8],[32,3,32,4],[30,0,30,1],[57,0,58,0],[57,1,58,1],[85,4,87,7],[36,5,36,6],[36,7,36,8],[84,4,84,7],[66,4,66,5],[67,4,67,5],[83,4,83,7],[77,4,77,5],[78,4,78,5]]}
[]
[]
[null,null,null,null,null,null,null," "," "," "]
[]
[]
[]
[null,null,null,null,null,null,null," "," "," "]
[]
[]
[]
[]
[]
[]
[]
[]
[]
[]
[]
[]
[]
[]
[]
[]
[]
[]
[]
[]
[]
[]
[]
["GLOBAL MAJOR MEDICAL HEALTH PLAN",null,null,"Nombre del Asegurado Titular",null,{"$f":"+'INGRESO DE DATOS'!$D$21","v":"NOMBRE COMPLETO"}]
[]
[null,null,null,"Número de adultos en la póliza",null,{"$f":"+'INGRESO DE DATOS'!$D$23","v":1},null,"Edad del Asegurado Titular",{"$f":"+'INGRESO DE DATOS'!$D$25","v":35}]
[]
[null,null,null,"Número de niños en la póliza",null,{"$f":"+'INGRESO DE DATOS'!$H$23","v":0},null,"Edad del/la conyuge",{"$f":"+'INGRESO DE DATOS'!$H$25","v":46}]
[null,null,null,null,null,null,null," "," "]
[null,null,null,null,null,"Fecha de la cotización:",null,{"$f":"NOW()","v":"2021-11-08T11:55:45.700"}]
[null,null,null,null,null,null," ",false,null," "]
[null,null,null,null,"Deducibles",null,"PLAN 1","PLAN 2","PLAN 3"]
[null,null,null,null,"En el país de residencia",null,7500,10000,20000]
{"$rows_left_out":47}
{"sheet":"Resumen tarifas","index":6,"n_rows":131,"n_cols":8,"rows_kept":131,"cut":false,"hidden":false,"merged":[[61,0,61,1],[49,0,49,1],[28,0,28,1],[31,0,31,1],[34,0,34,1],[58,0,58,1],[62,0,62,1],[100,4,100,7],[26,0,26,6],[57,0,57,1],[28,2,28,6],[31,4,31,5],[34,4,34,5],[39,0,39,1],[40,0,40,1],[43,0,43,1],[44,0,44,1],[45,0,45,1],[46,0,46,1],[48,0,48,1],[51,0,51,1],[43,2,43,3],[45,2,45,3],[48,2,48,3],[117,2,117,3],[117,0,117,1],[95,0,95,1],[63,0,63,1],[85,0,85,1],[79,0,79,1],[80,0,80,1],[81,0,81,1],[82,0,82,1],[64,0,64,1],[66,0,66,1],[67,0,67,1],[76,0,76,1],[96,0,96,1],[97,0,97,1],[108,0,108,2],[112,2,112,3],[101,0,101,1],[98,0,98,1],[100,0,100,1],[128,0,128,7],[129,0,129,7],[130,0,132,7],[109,0,109,1],[112,0,112,1],[115,0,115,1],[126,0,126,1],[114,2,114,3],[118,0,118,1],[114,0,114,1],[113,0,113,1],[52,2,52,3],[70,3,70,7],[87,4,87,7],[103,4,103,7],[120,2,120,3],[97,4,97,7],[61,3,61,7],[63,3,63,7],[66,3,66,7],[79,4,79,7],[81,4,81,7],[84,4,84,7],[95,4,95,7],[69,0,69,2],[84,0,84,1],[92,0,92,1]]}
[]
[null,null,null,null," "," "]
[]
[]
[]
[]
[]
[]
[]
[null,null,null,null," "," "," "]
[]
[]
[]
[]
[]
[]
[]
[]
[]
[]
[]
[]
[]
[]
[]
[]
["Cotizador de Seguro Médico - Bupa Global Health Plans"]
[]
["Nombre del Asegurado Titular",null,{"$f":"+'INGRESO DE DATOS'!$D$21","v":"NOMBRE COMPLETO"}]
[]
[]
["Número de adultos en la póliza",null,{"$f":"+'INGRESO DE DATOS'!$D$23","v":1},null,"Edad del Asegurado Titular",null,{"$f":"+'INGRESO DE DATOS'!$D$25","v":35}]
[]
[]
["Número de niños en la póliza",null,{"$f":"+'INGRESO DE DATOS'!$H$23","v":0},null,"Edad del/la cónyuge ",null,{"$f":"+'INGRESO DE DATOS'!$H$25","v":46}]
[]
[]
[null,null,null,"FECHA DE LA COTIZACIÓN:",{"$f":"NOW()","v":"2021-11-08T11:55:45.700"}]
[]
["Global Ultimate Health Plan"]
{"$rows_left_out":92}
{"sheet":"Tablas","index":7,"n_rows":1497,"n_cols":13,"rows_kept":1497,"cut":false,"hidden":false,"merged":[[752,0,752,1],[752,2,752,6],[825,0,825,6],[826,0,826,6],[827,0,827,1],[827,2,827,6],[751,0,751,6],[675,0,675,6],[676,0,676,6],[677,0,677,1],[677,2,677,6],[750,0,750,6],[527,0,527,1],[527,2,527,6],[600,0,600,6],[601,0,601,6],[602,0,602,1],[602,2,602,6],[526,0,526,6],[450,0,450,6],[451,0,451,6],[452,0,452,1],[452,2,452,6],[525,0,525,6],[376,0,376,1],[376,2,376,6],[150,0,150,6],[151,0,151,6],[152,0,152,1],[152,2,152,6],[225,0,225,6],[226,0,226,1],[375,0,375,6],[226,2,226,6],[300,0,300,6],[301,0,301,6],[302,0,302,1],[302,2,302,6],[1,0,1,6],[2,0,2,6],[77,0,77,1],[77,2,77,6],[76,0,76,6],[3,0,3,1],[3,2,3,6],[900,0,900,6],[901,0,901,6],[902,0,902,1],[902,2,902,6],[975,0,975,6],[976,0,976,1],[976,2,976,6],[1049,0,1049,6],[1050,0,1050,6],[1051,0,1051,1],[1051,2,1051,6],[1124,0,1124,6],[1125,0,1125,6],[1126,0,1126,1],[1126,2,1126,6],[1199,0,1199,6],[1200,0,1200,1],[1200,2,1200,6],[1273,0,1273,6],[1274,0,1274,6],[1275,0,1275,1],[1275,2,1275,6],[1424,0,1424,6],[1425,0,1425,1],[1425,2,1425,6],[1348,0,1348,6],[1349,0,1349,6],[1350,0,1350,1],[1350,2,1350,6],[1423,0,1423,6]]}
[]
["BUPA GLOBAL ELITE",null,null,null,null,null,null,null,"FACTOR MENSUAL:",null,{"$f":"1.12/12","v":9.3333333333333338E-2},null,{"$f":"1.12/12","v":9.3333333333333338E-2}]
["TARIFAS ANUALES",null,null,null,null,null,null,null,"FACTOR TRIMESTRAL:",null,0.25,null,{"$f":"1.1/4","v":0.27500000000000002}]
["EDAD",null,null,null,null,null,null,null,"FACTOR SEMIANUAL:",null,0.5,null,{"$f":"1.06/2","v":0.53}]
[" "," ",250,2000,3500,5000,10000,null,"Descuento (20%):",null,{"$f":"100%-20%","v":0.8},null,{"$f":"100%-20%","v":0.8}]
[18,null,6869,6019,5063,4390,3405]
[19,null,6869,6019,5063,4390,3405]
[20,null,6869,6019,5063,4390,3405]
[21,null,6869,6019,5063,4390,3405]
[22,null,6869,6019,5063,4390,3405]
[23,null,6869,6019,5063,4390,3405]
[24,null,6869,6019,5063,4390,3405]
[25,null,7341,6434,5379,4665,3618]
[26,null,7341,6434,5379,4665,3618]
[27,null,7341,6434,5379,4665,3618]
[28,null,7341,6434,5379,4665,3618]
[29,null,7341,6434,5379,4665,3618]
[30,null,8166,7157,5937,5147,3993]
[31,null,8166,7157,5937,5147,3993]
[32,null,8166,7157,5937,5147,3993]
[33,null,8166,7157,5937,5147,3993]
[34,null,8166,7157,5937,5147,3993]
[35,null,9116,7990,6591,5714,4432]
[36,null,9116,7990,6591,5714,4432]
[37,null,9116,7990,6591,5714,4432]
[38,null,9116,7990,6591,5714,4432]
[39,null,9116,7990,6591,5714,4432]
[40,null,10214,8951,7351,6374,4944]
[41,null,10214,8951,7351,6374,4944]
[42,null,10214,8951,7351,6374,4944]
[43,null,10214,8951,7351,6374,4944]
[44,null,10214,8951,7351,6374,4944]
[45,null,11429,10019,8203,7113,5517]
[46,null,11429,10019,8203,7113,5517]
[47,null,11429,10019,8203,7113,5517]
[48,null,11429,10019,8203,7113,5517]
[49,null,11429,10019,8203,7113,5517]
[50,null,12802,11222,9165,7946,6164]
[51,null,12802,11222,9165,7946,6164]
[52,null,12802,11222,9165,7946,6164]
{"$rows_left_out":1457}