{"text_format":"1","workbook":"xlsx","n_sheets":8,"sheets":["INGRESO DE DATOS","Global Ultimate Health  Plan","Global Elite Health  Plan","Global Premier Health  Plan","Global Select Health  Plan","Global Major Medical Health  Pl","Resumen tarifas","Tablas"],"not_rendered":{"charts":0,"images":19,"macros":1,"external_links":0,"defined_names":6,"comments":1,"pivot_tables":0},"unopened":[],"bounds":{"document_bytes":16777216,"sheet_cells":100000,"rows_first":2000,"rows_last":500,"rows_between":2000,"halvings":0,"cell_chars":16384,"cell_head_chars":4096},"cells_cut":0,"cells_raw":0,"read":"whole","date_system":"1900"}

{"sheet":"INGRESO DE DATOS","index":0,"n_rows":53,"n_cols":9,"rows_kept":53,"cut":false,"hidden":false,"merged":[[50,3,50,4],[50,6,50,7],[17,0,17,12],[25,5,25,6],[21,1,21,2],[23,1,23,2],[21,3,21,7],[23,5,23,6],[25,1,25,2],[27,3,27,7]]}
[]
[null,null,null,null,null,null,null," "," "]
[]
[]
[]
[null,null,null,null,null,null,null," "," "]
[]
[]
[]
[]
[]
[]
[]
[]
[]
[]
[]
[]
[]
["1. LLENE LA INFORMACIÓN DEL ASEGURADO PROPUESTO:"]
[]
[null,"Nombre del Asegurado Titular",null,"JOHN DOE"]
[]
[null,"Número de adultos en la póliza",null,2,null,"Número de niños en la póliza",null,3]
[]
[null,"Edad del Asegurado Titular",null,49,null,"Edad del/la cónyuge ",null,39]
[]
[null,null,"Cotizador por","NOMBRE DE AGENTE"]
[]
[]
[]
["2. SELECCIONE EL PRODUCTO PARA VER LA COTIZACIÓN CORRESPONDIENTE: "]
[]
[]
[]
[]
[]
[]
[]
[]
{"$rows_left_out":14}
{"sheet":"Global Ultimate Health  Plan","index":1,"n_rows":86,"n_cols":11,"rows_kept":86,"cut":false,"hidden":false,"merged":[[109,0,109,1],[78,0,79,1],[95,0,95,1],[26,3,26,4],[47,0,47,1],[63,0,63,1],[67,0,67,1],[83,0,83,1],[85,4,87,7],[84,4,84,7],[66,4,66,5],[41,4,41,5],[60,4,60,5],[74,4,74,5],[75,4,75,5],[81,4,81,5],[43,4,43,7],[55,4,55,7],[70,4,70,7],[48,0,49,0],[48,1,49,1],[53,4,53,5],[59,4,59,5],[19,3,19,4],[19,5,19,8],[22,3,22,4],[24,3,24,4],[42,0,42,1],[32,4,32,7],[19,0,20,1],[20,3,20,4],[20,5,20,8],[27,0,27,1]]}
[]
[]
[null,null,null,null,null,null,null," "," "," "]
[]
[]
[]
[null,null,null,null,null,null,null," "," "," "]
[]
[]
[]
[]
[]
[]
[]
[]
[]
[]
[]
[]
["Global Ultimate Health Plan",null,null,"Nombre del Asegurado Titular",null,{"$f":"+'INGRESO DE DATOS'!$D$22","v":"JOHN DOE"}]
[null,null,null,"Cotizado por",null,{"$f":"+'INGRESO DE DATOS'!$D$28","v":"NOMBRE DE AGENTE"}]
[]
[null,null,null,"Número de adultos en la póliza",null,{"$f":"+'INGRESO DE DATOS'!$D$24","v":2},null,"Edad del Asegurado Titular",{"$f":"+'INGRESO DE DATOS'!$D$26","v":49}]
[]
[null,null,null,"Número de niños en la póliza",null,3,null,"Edad del/la conyuge",{"$f":"+'INGRESO DE DATOS'!$H$26","v":39}]
[null,null,null,null,null,null,null," "," "]
[null,null,null,"Número de niños menores de 16 años",null,{"$f":"+'INGRESO DE DATOS'!$B$53","v":2},"Fecha de la cotización :",{"$f":"NOW()","v":"2020-12-16T16:14:06.940"}]
[null,null,null,null,null,null," ",false,null," ","s"]
[null,null,null,null,"Deducibles",null,"PLAN 1","PLAN 2"]
[null,null,null,null,"En el país de residencia",null,0,1000]
[null,null,null,null,"Fuera del país de residencia",null,0,1000]
[]
[null,null,null,null,"Tarifas Anuales"]
[null,null,null,null,"Prima para Asegurado Titular",null,{"$f":"(VLOOKUP($I$23,Tablas!$A$905:$G$971,3,TRUE))*1.1494","v":32553.306799999998},{"$f":"(VLOOKUP($I$23,Tablas!$A$905:$G$971,4,TRUE))*1.1494","v":21004.135599999998}]
[null,null,null,null,"Prima para conyuge",null,{"$f":"(IF($F$23=1,0,(VLOOKUP($I$25,Tablas!$A$905:$G$971,3,TRUE))))*1.1494","v":25950.003799999999},{"$f":"(IF($F$23=1,0,(VLOOKUP($I$25,Tablas!$A$905:$G$971,4,TRUE))))*1.1494","v":16742.160400000001}]
[null,null,null,null,"Prima para hijo (s)",null,{"$f":"(IF(('INGRESO DE DATOS'!H24 - 'INGRESO DE DATOS'!B53)<=0,0,IF(('INGRESO DE DATOS'!H24 - 'INGRESO DE DATOS'!B53)=Tablas!A972,Tablas!C972,IF(('INGRESO DE DATOS'!H24 - 'INGRESO DE DATOS'!B53)=Tablas!A973,Tablas!C973,Tablas!C974))))*1.1494","v":8156.1423999999997},{"$f":"(IF(('INGRESO DE DATOS'!H24 - 'INGRESO DE DATOS'!B53)<=0,0,IF(('INGRESO DE DATOS'!H24 - 'INGRESO DE DATOS'!B53)=Tablas!A972,Tablas!D972,IF(('INGRESO DE DATOS'!H24 - 'INGRESO DE DATOS'!B53)=Tablas!A973,Tablas!D973,Tablas!D974))))*1.1494","v":5263.1026000000002}]
[null,null,null,null,"Total de Prima neta",null,{"$f":"(SUM(G34:G36))","v":66659.452999999994},{"$f":"(SUM(H34:H36))","v":43009.3986}]
[null,null,null,null,"Costo administrativo anual",null,86,86]
[null,null,null,null,"Impuesto (14.49%)",null,{"$f":"(G38)*0%","v":0},{"$f":"(H38)*0%","v":0}]
[]
{"$rows_left_out":47}
{"sheet":"Global Elite Health  Plan","index":2,"n_rows":84,"n_cols":11,"rows_kept":84,"cut":false,"hidden":false,"merged":[[83,0,83,1],[93,0,93,1],[46,0,46,1],[63,0,63,1],[83,4,84,10],[82,4,82,10],[42,4,42,10],[54,4,54,10],[25,3,25,4],[23,3,23,4],[18,5,18,8],[18,3,18,4],[21,3,21,4],[18,0,19,1],[19,5,19,8],[73,4,73,5],[72,4,72,5],[79,4,79,5],[68,4,68,10],[26,0,26,1],[41,0,41,1],[67,0,67,1],[79,0,79,1],[31,4,31,10],[40,4,40,5],[52,4,52,5],[65,4,65,5],[58,4,58,5],[59,4,59,5]]}
[]
[]
[null,null,null,null,null,null,null," "," "," "]
[]
[]
[]
[null,null,null,null,null,null,null," "," "," "]
[]
[]
[]
[]
[]
[]
[]
[]
[]
[]
[]
["Bupa Global Elite Health Plan",null,null,"Nombre del Asegurado Titular",null,{"$f":"+'INGRESO DE DATOS'!$D$22","v":"JOHN DOE"}]
[null,null,null,null,"Cotizado por",{"$f":"+'INGRESO DE DATOS'!$D$28","v":"NOMBRE DE AGENTE"}]
[]
[null,null,null,"Número de adultos en la póliza",null,{"$f":"+'INGRESO DE DATOS'!$D$24","v":2},null,"Edad del Asegurado Titular",{"$f":"+'INGRESO DE DATOS'!$D$26","v":49}]
[]
[null,null,null,"Número de niños en la póliza",null,{"$f":"+'INGRESO DE DATOS'!$H$24","v":3},null,"Edad del/la conyuge",{"$f":"+'INGRESO DE DATOS'!$H$26","v":39}]
[null,null,null,null,null,null,null," "," "]
[null,null,null,"Número de niños menores de 10 años",null,{"$f":"+'INGRESO DE DATOS'!$D$53","v":1},"Fecha de la cotización :",{"$f":"NOW()","v":"2020-12-16T16:14:06.940"}]
[null,null,null,null,null,null," ",false,null," "]
[null,null,null,null,"Deducibles",null,"PLAN 1","PLAN 2","PLAN 3","PLAN 4","PLAN 5"]
[null,null,null,null,"En el país de residencia",null,250,2000,3500,5000,10000]
[null,null,null,null,"Fuera del país de residencia",null,5000,2000,3500,5000,10000]
[]
[null,null,null,null,"Tarifas Anuales"]
[null,null,null,null,"Prima para Asegurado Titular",null,{"$f":"(VLOOKUP($I$22,Tablas!$A$6:$G$72,3,TRUE))*1.1494","v":13900.8436},{"$f":"(VLOOKUP($I$22,Tablas!$A$6:$G$72,4,TRUE))*1.1494","v":12183.64},{"$f":"(VLOOKUP($I$22,Tablas!$A$6:$G$72,5,TRUE))*1.1494","v":10027.365599999999},{"$f":"(VLOOKUP($I$22,Tablas!$A$6:$G$72,6,TRUE))*1.1494","v":8694.0615999999991},{"$f":"(VLOOKUP($I$22,Tablas!$A$6:$G$72,7,TRUE))*1.1494","v":6742.3804}]
[null,null,null,null,"Prima para conyuge",null,{"$f":"(IF($F$22=1,0,(VLOOKUP($I$24,Tablas!$A$6:$G$72,3,TRUE))))*1.1494","v":11090.560599999999},{"$f":"(IF($F$22=1,0,(VLOOKUP($I$24,Tablas!$A$6:$G$72,4,TRUE))))*1.1494","v":9718.1769999999997},{"$f":"(IF($F$22=1,0,(VLOOKUP($I$24,Tablas!$A$6:$G$72,5,TRUE))))*1.1494","v":8059.5927999999994},{"$f":"(IF($F$22=1,0,(VLOOKUP($I$24,Tablas!$A$6:$G$72,6,TRUE))))*1.1494","v":6989.5014000000001},{"$f":"(IF($F$22=1,0,(VLOOKUP($I$24,Tablas!$A$6:$G$72,7,TRUE))))*1.1494","v":5420.5703999999996}]
[null,null,null,null,"Prima para hijo (s)",null,{"$f":"(IF(('INGRESO DE DATOS'!H24 - 'INGRESO DE DATOS'!D53)<=0,0,IF(('INGRESO DE DATOS'!H24 - 'INGRESO DE DATOS'!D53)=Tablas!A73,Tablas!C73,IF(('INGRESO DE DATOS'!H24 - 'INGRESO DE DATOS'!D53)=Tablas!A74,Tablas!C74,Tablas!C75))))*1.1494","v":6005.6149999999998},{"$f":"(IF(('INGRESO DE DATOS'!H24 - 'INGRESO DE DATOS'!D53)<=0,0,IF(('INGRESO DE DATOS'!H24 - 'INGRESO DE DATOS'!D53)=Tablas!A73,Tablas!D73,IF(('INGRESO DE DATOS'!H24 - 'INGRESO DE DATOS'!D53)=Tablas!A74,Tablas!D74,Tablas!D75))))*1.1494","v":5265.4013999999997},{"$f":"(IF(('INGRESO DE DATOS'!H24 - 'INGRESO DE DATOS'!D53)<=0,0,IF(('INGRESO DE DATOS'!H24 - 'INGRESO DE DATOS'!D53)=Tablas!A73,Tablas!E73,IF(('INGRESO DE DATOS'!H24 - 'INGRESO DE DATOS'!D53)=Tablas!A74,Tablas!E74,Tablas!E75))))*1.1494","v":4482.66},{"$f":"(IF(('INGRESO DE DATOS'!H24 - 'INGRESO DE DATOS'!D53)<=0,0,IF(('INGRESO DE DATOS'!H24 - 'INGRESO DE DATOS'!D53)=Tablas!A73,Tablas!F73,IF(('INGRESO DE DATOS'!H24 - 'INGRESO DE DATOS'!D53)=Tablas!A74,Tablas!F74,Tablas!F75))))*1.1494","v":3888.4202},{"$f":"(IF(('INGRESO DE DATOS'!H24 - 'INGRESO DE DATOS'!D53)<=0,0,IF(('INGRESO DE DATOS'!H24 - 'INGRESO DE DATOS'!D53)=Tablas!A73,Tablas!G73,IF(('INGRESO DE DATOS'!H24 - 'INGRESO DE DATOS'!D53)=Tablas!A74,Tablas!G74,Tablas!G75))))*1.1494","v":3014.8762000000002}]
[null,null,null,null,"Total de Prima neta",null,{"$f":"(SUM(G33:G35))","v":30997.019199999995},{"$f":"(SUM(H33:H35))","v":27167.218399999998},{"$f":"(SUM(I33:I35))","v":22569.618399999999},{"$f":"(SUM(J33:J35))","v":19571.983199999999},{"$f":"(SUM(K33:K35))","v":15177.826999999999}]
[null,null,null,null,"Costo Administrativo Anual",null,86,86,86,86,86]
[null,null,null,null,"IVA (14.49%)",null,{"$f":"(G37)*0%","v":0},{"$f":"(H37)*0%","v":0},{"$f":"(I37)*0%","v":0},{"$f":"(J37)*0%","v":0},{"$f":"(K37)*0%","v":0}]
[]
[null,null,null,null,"TOTAL ANUAL",null,{"$f":"SUM(G36:G38)","v":31083.019199999995},{"$f":"SUM(H36:H38)","v":27253.218399999998},{"$f":"SUM(I36:I38)","v":22655.618399999999},{"$f":"SUM(J36:J38)","v":19657.983199999999},{"$f":"SUM(K36:K38)","v":15263.826999999999}]
{"$rows_left_out":45}
{"sheet":"Global Premier Health  Plan","index":3,"n_rows":84,"n_cols":10,"rows_kept":84,"cut":false,"hidden":false,"merged":[[82,4,82,9],[83,4,84,9],[71,0,71,1],[82,0,82,1],[86,0,86,1],[96,0,96,1],[22,3,22,4],[25,3,25,4],[27,3,27,4],[22,5,22,8],[22,0,23,1],[23,5,23,8],[60,4,60,5],[61,4,61,5],[73,4,73,5],[74,4,74,5],[35,4,35,9],[45,4,45,9],[56,4,56,9],[69,4,69,9],[67,0,67,1],[30,0,30,1],[45,0,45,1],[50,0,50,1],[51,1,52,1],[51,0,52,0]]}
[]
[]
[null,null,null,null,null,null,null," "," "," "]
[]
[]
[]
[null,null,null,null,null,null,null," "," "," "]
[]
[]
[]
[]
[]
[]
[]
[]
[]
[]
[]
[]
[]
[]
[]
["Global Premier Health Plan",null,null,"Nombre del Asegurado Titular",null,{"$f":"+'INGRESO DE DATOS'!$D$22","v":"JOHN DOE"}]
[null,null,null,null,"Cotizado por",{"$f":"+'INGRESO DE DATOS'!$D$28","v":"NOMBRE DE AGENTE"}]
[]
[null,null,null,"Número de adultos en la póliza",null,{"$f":"+'INGRESO DE DATOS'!$D$24","v":2},null,"Edad del Asegurado Titular",{"$f":"+'INGRESO DE DATOS'!$D$26","v":49}]
[]
[null,null,null,"Número de niños en la póliza",null,{"$f":"+'INGRESO DE DATOS'!$H$24","v":3},null,"Edad del/la conyuge",{"$f":"+'INGRESO DE DATOS'!$H$26","v":39}]
[null,null,null,null,null,null,null," "," "]
[null,null,null,null,null,"Fecha de la cotización :",{"$f":"NOW()","v":"2020-12-16T16:14:06.940"}]
[null,null,null,null,null,null," ",false,null," "]
[null,null,null,null,"Deducibles",null,"PLAN 1","PLAN 2","PLAN 3","PLAN 4"]
[null,null,null,null,"En el país de residencia",null,250,2000,5000,10000]
[null,null,null,null,"Fuera del país de residencia",null,5000,2000,5000,10000]
[]
[null,null,null,null,"Tarifas Anuales"]
[null,null,null,null,"Prima para Asegurado Titular",null,{"$f":"(VLOOKUP($I$26,Tablas!$A$155:$G$221,3,TRUE))*1.1494","v":9135.4311999999991},{"$f":"(VLOOKUP($I$26,Tablas!$A$155:$G$221,4,TRUE))*1.1494","v":8291.7716},{"$f":"(VLOOKUP($I$26,Tablas!$A$155:$G$221,5,TRUE))*1.1494","v":6057.3379999999997},{"$f":"(VLOOKUP($I$26,Tablas!$A$155:$G$221,6,TRUE))*1.1494","v":4505.6480000000001}]
[null,null,null,null,"Prima para conyuge",null,{"$f":"(IF($F$26=1,0,(VLOOKUP($I$28,Tablas!$A$155:$G$221,3,TRUE))))*1.1494","v":7288.3454000000002},{"$f":"(IF($F$26=1,0,(VLOOKUP($I$28,Tablas!$A$155:$G$221,4,TRUE))))*1.1494","v":6614.7969999999996},{"$f":"(IF($F$26=1,0,(VLOOKUP($I$28,Tablas!$A$155:$G$221,5,TRUE))))*1.1494","v":4897.5933999999997},{"$f":"(IF($F$26=1,0,(VLOOKUP($I$28,Tablas!$A$155:$G$221,6,TRUE))))*1.1494","v":3642.4485999999997}]
[null,null,null,null,"Prima para hijo (s)",null,{"$f":"(IF($F$28=0,0,(VLOOKUP($F$28,Tablas!$A$222:$G$224,3,TRUE))))*1.1494","v":5572.2911999999997},{"$f":"(IF($F$28=0,0,(VLOOKUP($F$28,Tablas!$A$222:$G$224,4,TRUE))))*1.1494","v":5057.3599999999997},{"$f":"(IF($F$28=0,0,(VLOOKUP($F$28,Tablas!$A$222:$G$224,5,TRUE))))*1.1494","v":3918.3045999999999},{"$f":"(IF($F$28=0,0,(VLOOKUP($F$28,Tablas!$A$222:$G$224,6,TRUE))))*1.1494","v":2914.8784000000001}]
[null,null,null,null,"Total de Prima neta",null,{"$f":"(SUM(G37:G39))","v":21996.067799999997},{"$f":"(SUM(H37:H39))","v":19963.928599999999},{"$f":"(SUM(I37:I39))","v":14873.235999999999},{"$f":"(SUM(J37:J39))","v":11062.975}]
{"$rows_left_out":45}
{"sheet":"Global Select Health  Plan","index":4,"n_rows":84,"n_cols":10,"rows_kept":84,"cut":false,"hidden":false,"merged":[[83,4,84,9],[36,4,36,9],[46,4,46,9],[57,4,57,9],[70,4,70,9],[82,4,82,9],[74,4,74,5],[75,4,75,5],[67,0,67,1],[71,0,71,1],[82,0,82,1],[86,0,86,1],[96,0,96,1],[51,1,52,1],[51,0,52,0],[28,3,28,4],[61,4,61,5],[62,4,62,5],[30,0,30,1],[45,0,45,1],[50,0,50,1],[22,3,22,4],[25,3,25,4],[22,5,22,8],[25,0,26,1],[23,5,23,8]]}
[]
[]
[null,null,null,null,null,null,null," "," "," "]
[]
[]
[]
[null,null,null,null,null,null,null," "," "," "]
[]
[]
[]
[]
[]
[]
[]
[]
[]
[]
[]
[]
[]
[]
[]
[null,null,null,"Nombre del Asegurado Titular",null,{"$f":"+'INGRESO DE DATOS'!$D$22","v":"JOHN DOE"}]
[null,null,null,null,"Cotizado por",{"$f":"+'INGRESO DE DATOS'!$D$28","v":"NOMBRE DE AGENTE"}]
[]
["Global Select Health Plan",null,null,"Número de adultos en la póliza",null,{"$f":"+'INGRESO DE DATOS'!$D$24","v":2},null,"Edad del Asegurado Titular",{"$f":"+'INGRESO DE DATOS'!$D$26","v":49}]
[]
[null,null,null,null,null,null,null,"Edad del/la conyuge",{"$f":"+'INGRESO DE DATOS'!$H$26","v":39}]
[null,null,null,"Número de niños en la póliza",null,{"$f":"+'INGRESO DE DATOS'!$H$24","v":3},null," "," "]
[]
[null,null,null,null,null,"Fecha de la cotización:",{"$f":"NOW()","v":"2020-12-16T16:14:06.940"}]
[null,null,null,null,null,null," ",false,null," "]
[null,null,null,null,"Deducibles",null,"PLAN 1","PLAN 2","PLAN 3","PLAN 4"]
[null,null,null,null,"En el país de residencia",null,250,2000,5000,10000]
[null,null,null,null,"Fuera del país de residencia",null,5000,2000,5000,10000]
[]
[null,null,null,null,"Tarifas Anuales"]
[null,null,null,null,"Prima para Asegurado Titular",null,{"$f":"(VLOOKUP($I$26,Tablas!$A$305:$G$371,3,TRUE))*1.1494","v":6323.9988000000003},{"$f":"(VLOOKUP($I$26,Tablas!$A$305:$G$371,4,TRUE))*1.1494","v":6066.5331999999999},{"$f":"(VLOOKUP($I$26,Tablas!$A$305:$G$371,5,TRUE))*1.1494","v":4440.1322},{"$f":"(VLOOKUP($I$26,Tablas!$A$305:$G$371,6,TRUE))*1.1494","v":3303.3755999999998}]
[null,null,null,null,"Prima para conyuge",null,{"$f":"(IF($F$26=1,0,(VLOOKUP($I$28,Tablas!$A$305:$G$371,3,TRUE))))*1.1494","v":4926.3284000000003},{"$f":"(IF($F$26=1,0,(VLOOKUP($I$28,Tablas!$A$305:$G$371,4,TRUE))))*1.1494","v":4726.3328000000001},{"$f":"(IF($F$26=1,0,(VLOOKUP($I$28,Tablas!$A$305:$G$371,5,TRUE))))*1.1494","v":3506.8193999999999},{"$f":"(IF($F$26=1,0,(VLOOKUP($I$28,Tablas!$A$305:$G$371,6,TRUE))))*1.1494","v":2610.2874000000002}]
[null,null,null,null,"Prima para hijo (s)",null,{"$f":"(IF($F$29=0,0,(VLOOKUP($F$29,Tablas!$A$372:$G$374,3,TRUE))))*1.1494","v":4002.2107999999998},{"$f":"(IF($F$29=0,0,(VLOOKUP($F$29,Tablas!$A$372:$G$374,4,TRUE))))*1.1494","v":3838.9960000000001},{"$f":"(IF($F$29=0,0,(VLOOKUP($F$29,Tablas!$A$372:$G$374,5,TRUE))))*1.1494","v":2994.1869999999999},{"$f":"(IF($F$29=0,0,(VLOOKUP($F$29,Tablas!$A$372:$G$374,6,TRUE))))*1.1494","v":2227.5371999999998}]
{"$rows_left_out":45}
{"sheet":"Global Major Medical Health  Pl","index":5,"n_rows":138,"n_cols":22,"rows_kept":138,"cut":false,"hidden":false,"merged":[[96,0,96,1],[50,0,50,1],[67,0,67,1],[71,0,71,1],[82,0,82,1],[86,0,86,1],[51,0,52,0],[51,1,52,1],[81,4,83,7],[80,4,80,7],[60,4,60,5],[61,4,61,5],[72,4,72,5],[73,4,73,5],[68,4,68,7],[22,0,23,1],[23,5,23,8],[30,0,30,1],[45,0,45,1],[56,4,56,7],[27,3,27,4],[22,3,22,4],[22,5,22,8],[25,3,25,4],[45,4,45,7],[35,4,35,7]]}
[]
[]
[null,null,null,null,null,null,null," "," "," "]
[]
[]
[]
[null,null,null,null,null,null,null," "," "," "]
[]
[]
[]
[]
[]
[]
[]
[]
[]
[]
[]
[]
[]
[]
[]
["Global Major Medical Health Plan",null,null,"Nombre del Asegurado Titular",null,{"$f":"+'INGRESO DE DATOS'!$D$22","v":"JOHN DOE"}]
[null,null,null,null,"Cotizado Por",{"$f":"+'INGRESO DE DATOS'!$D$28","v":"NOMBRE DE AGENTE"}]
[]
[null,null,null,"Número de adultos en la póliza",null,{"$f":"+'INGRESO DE DATOS'!$D$24","v":2},null,"Edad del Asegurado Titular",{"$f":"+'INGRESO DE DATOS'!$D$26","v":49}]
[]
[null,null,null,"Número de niños en la póliza",null,{"$f":"+'INGRESO DE DATOS'!$H$24","v":3},null,"Edad del/la conyuge",{"$f":"+'INGRESO DE DATOS'!$H$26","v":39}]
[null,null,null,null,null,null,null," "," "]
[null,null,null,null,null,"Fecha de la cotización:",{"$f":"NOW()","v":"2020-12-16T16:14:06.940"}]
[null,null,null,null,null,null," ",false,null," "]
[null,null,null,null,"Deducibles",null,"PLAN 1","PLAN 2"]
[null,null,null,null,"En el país de residencia",null,10000,20000]
[null,null,null,null,"Fuera del país de residencia",null,10000,20000]
[]
[null,null,null,null,"Tarifas Anuales"]
[null,null,null,null,"Prima para Asegurado Titular",null,{"$f":"(VLOOKUP($I$26,Tablas!$A$1129:$G$1195,3,TRUE))*1.1494","v":3914.8564000000001},{"$f":"(VLOOKUP($I$26,Tablas!$A$1129:$G$1195,4,TRUE))*1.1494","v":2975.7966000000001}]
[null,null,null,null,"Prima para conyuge",null,{"$f":"(IF($F$26=1,0,(VLOOKUP($I$28,Tablas!$A$1129:$G$1195,3,TRUE))))*1.1494","v":3120.6210000000001},{"$f":"(IF($F$26=1,0,(VLOOKUP($I$28,Tablas!$A$1129:$G$1195,4,TRUE))))*1.1494","v":2370.0628000000002}]
[null,null,null,null,"Prima para hijo (s)",null,{"$f":"(IF($F$28=0,0,(VLOOKUP($F$28,Tablas!$A$1196:$G$1198,3,TRUE))))*1.1494","v":2370.0628000000002},{"$f":"(IF($F$28=0,0,(VLOOKUP($F$28,Tablas!$A$1196:$G$1198,4,TRUE))))*1.1494","v":1859.7292}]
[null,null,null,null,"Total de Prima neta",null,{"$f":"(SUM(G37:G39))","v":9405.5401999999995},{"$f":"(SUM(H37:H39))","v":7205.5886}]
{"$rows_left_out":99}
{"sheet":"Resumen tarifas","index":6,"n_rows":106,"n_cols":8,"rows_kept":106,"cut":false,"hidden":false,"merged":[[104,0,104,7],[70,4,70,7],[77,4,77,7],[79,4,79,7],[81,4,81,7],[83,4,83,7],[78,0,78,1],[91,0,91,1],[92,0,92,1],[74,1,74,3],[77,0,77,1],[101,0,101,3],[100,0,100,3],[64,4,64,7],[66,4,66,7],[68,4,68,7],[50,3,50,7],[52,3,52,7],[54,3,54,7],[22,2,22,6],[58,0,58,2],[53,0,53,1],[54,0,54,1],[55,0,55,1],[38,2,38,3],[40,2,40,3],[41,0,41,1],[27,0,27,1],[50,0,50,1],[51,0,51,1],[42,2,42,3],[52,0,52,1],[56,3,56,7],[105,0,107,6],[87,0,87,1],[90,0,90,1],[79,0,79,1],[86,0,86,2],[90,2,90,3],[82,0,82,1],[80,0,80,1],[81,0,81,1],[93,0,93,1],[102,0,102,1],[92,2,92,3],[94,2,94,3],[94,0,94,1],[95,0,95,1],[96,2,96,3],[19,0,19,6],[46,0,46,1],[21,2,21,6],[24,4,24,5],[27,4,27,5],[32,0,32,1],[33,0,33,1],[36,0,36,1],[37,0,37,1],[38,0,38,1],[39,0,39,1],[40,0,40,1],[44,0,44,1],[36,2,36,3],[21,0,21,1],[24,0,24,1],[61,0,61,1],[69,0,69,1],[64,0,64,1],[65,0,65,1],[66,0,66,1],[67,0,67,1],[68,0,68,1]]}
[]
[null,null,null,null," "," "]
[]
[]
[]
[null,null,null,null," "," "," "]
[]
[]
[]
[]
[]
[]
[]
[]
[]
[]
[]
[]
[]
["Cotización de Seguro Médico - Global Health Plans"]
[]
["Nombre del Asegurado Titular",null,{"$f":"+'INGRESO DE DATOS'!$D$22","v":"JOHN DOE"}]
[null,"Cotizado por",{"$f":"+'INGRESO DE DATOS'!$D$28","v":"NOMBRE DE AGENTE"}]
[]
["Número de adultos en la póliza",null,{"$f":"+'INGRESO DE DATOS'!$D$24","v":2},null,"Edad del Asegurado Titular",null,{"$f":"+'INGRESO DE DATOS'!$D$26","v":49}]
[]
[]
["Número de niños en la póliza",null,{"$f":"+'INGRESO DE DATOS'!$H$24","v":3},null,"Edad del/la cónyuge ",null,{"$f":"+'INGRESO DE DATOS'!$H$26","v":39}]
[]
[]
[null,null,"Fecha de la Cotización:",{"$f":"NOW()","v":"2020-12-16T16:14:06.940"}]
[]
["Bupa Global Ultimtate Health Plan"]
["Deducibles",null,"PLAN 1","PLAN 2"]
["En el país de residencia",null,0,1000]
["Fuera del país de residencia",null,0,1000]
[null,null,"Tarifas Anuales"]
[null,null,{"$f":"'Global Ultimate Health  Plan'!G41","v":66745.452999999994},{"$f":"'Global Ultimate Health  Plan'!H41","v":43095.3986}]
[null,null,"Tarifas Semi-anuales"]
[null,null,{"$f":"'Global Ultimate Health  Plan'!G52","v":35329.510090000003},{"$f":"'Global Ultimate Health  Plan'!H52","v":22794.981258}]
{"$rows_left_out":67}
{"sheet":"Tablas","index":7,"n_rows":1497,"n_cols":13,"rows_kept":1497,"cut":false,"hidden":true,"merged":[[1424,0,1424,6],[1425,0,1425,1],[1425,2,1425,6],[1348,0,1348,6],[1349,0,1349,6],[1350,0,1350,1],[1350,2,1350,6],[1423,0,1423,6],[1200,0,1200,1],[1200,2,1200,6],[1273,0,1273,6],[1274,0,1274,6],[1275,0,1275,1],[1275,2,1275,6],[1124,0,1124,6],[1125,0,1125,6],[1126,0,1126,1],[1126,2,1126,6],[1199,0,1199,6],[976,0,976,1],[976,2,976,6],[1049,0,1049,6],[1050,0,1050,6],[1051,0,1051,1],[1051,2,1051,6],[900,0,900,6],[901,0,901,6],[902,0,902,1],[902,2,902,6],[975,0,975,6],[1,0,1,6],[2,0,2,6],[77,0,77,1],[77,2,77,6],[76,0,76,6],[3,0,3,1],[3,2,3,6],[376,0,376,1],[376,2,376,6],[150,0,150,6],[151,0,151,6],[152,0,152,1],[152,2,152,6],[225,0,225,6],[226,0,226,1],[375,0,375,6],[226,2,226,6],[300,0,300,6],[301,0,301,6],[302,0,302,1],[302,2,302,6],[526,0,526,6],[450,0,450,6],[451,0,451,6],[452,0,452,1],[452,2,452,6],[525,0,525,6],[527,0,527,1],[527,2,527,6],[600,0,600,6],[601,0,601,6],[602,0,602,1],[602,2,602,6],[751,0,751,6],[675,0,675,6],[676,0,676,6],[677,0,677,1],[677,2,677,6],[750,0,750,6],[752,0,752,1],[752,2,752,6],[825,0,825,6],[826,0,826,6],[827,0,827,1],[827,2,827,6]]}
[]
["BUPA GLOBAL ELITE",null,null,null,null,null,null,null,"FACTOR MENSUAL:",null,9.3333333333333338E-2]
["TARIFAS ANUALES",null,null,null,null,null,null,null,"FACTOR TRIMESTRAL:",null,0.27500000000000002]
["EDAD",null,null,null,null,null,null,null,"FACTOR SEMIANUAL:",null,0.53]
[" "," ",250,2000,3500,5000,10000]
[18,null,7275,6375,5390,4676,3626,null,true,true,true,true,true]
[19,null,7275,6375,5390,4676,3626]
[20,null,7275,6375,5390,4676,3626]
[21,null,7275,6375,5390,4676,3626]
[22,null,7275,6375,5390,4676,3626]
[23,null,7275,6375,5390,4676,3626]
[24,null,7275,6375,5390,4676,3626]
[25,null,7772,6812,5725,4964,3851,null,true,true,true,true,true]
[26,null,7772,6812,5725,4964,3851]
[27,null,7772,6812,5725,4964,3851]
[28,null,7772,6812,5725,4964,3851]
[29,null,7772,6812,5725,4964,3851]
[30,null,8643,7576,6319,5478,4249,null,true,true,true,true,true]
[31,null,8643,7576,6319,5478,4249]
[32,null,8643,7576,6319,5478,4249]
[33,null,8643,7576,6319,5478,4249]
[34,null,8643,7576,6319,5478,4249]
[35,null,9649,8455,7012,6081,4716,null,true,true,true,true,true]
[36,null,9649,8455,7012,6081,4716]
[37,null,9649,8455,7012,6081,4716]
[38,null,9649,8455,7012,6081,4716]
[39,null,9649,8455,7012,6081,4716]
[40,null,10807,9471,7819,6780,5260,null,true,true,true,true,true]
[41,null,10807,9471,7819,6780,5260]
[42,null,10807,9471,7819,6780,5260]
[43,null,10807,9471,7819,6780,5260]
[44,null,10807,9471,7819,6780,5260]
[45,null,12094,10600,8724,7564,5866,null,true,true,true,true,true]
[46,null,12094,10600,8724,7564,5866]
[47,null,12094,10600,8724,7564,5866]
[48,null,12094,10600,8724,7564,5866]
[49,null,12094,10600,8724,7564,5866]
[50,null,13541,11870,9745,8451,6554,null,true,true,true,true,true]
[51,null,13541,11870,9745,8451,6554]
[52,null,13541,11870,9745,8451,6554]
{"$rows_left_out":1457}