{"text_format":"1","workbook":"xlsx","n_sheets":10,"sheets":["INGRESO DE DATOS","Complete","Secure","Premium","Advantage (LA)","Blue 500","Blue 100","Classic","Resumen tarifas anuales","Tablas"],"not_rendered":{"charts":0,"images":7,"macros":1,"external_links":0,"defined_names":5,"comments":1,"pivot_tables":0},"unopened":[],"bounds":{"document_bytes":16777216,"sheet_cells":100000,"rows_first":2000,"rows_last":500,"rows_between":2000,"halvings":0,"cell_chars":16384,"cell_head_chars":4096},"cells_cut":0,"cells_raw":0,"read":"whole","date_system":"1900"}

{"sheet":"INGRESO DE DATOS","index":0,"n_rows":27,"n_cols":12,"rows_kept":27,"cut":false,"hidden":false,"merged":[[15,7,15,8],[11,3,11,9],[13,3,13,5],[13,7,13,8],[22,3,22,9]]}
[]
[]
[]
[]
[" "]
[]
[]
[null,null,null,null,null,null,null,null,null,null," "]
[]
["1. INGRESE LOS DATOS DEL PROPUESTO ASEGURADO:"]
[]
[null,null,"Nombre del Asegurado Principal:","Nombre"]
[null,null,null,null,null,null,null,null,null,null," "," "]
[null,null,null,"Número de Adultos:",null,null,2,"Número de Hijos:",null,3]
[]
[null,null,null,null,null," Edad de Titular:",65,"Edad de Cónyuge:",null,18]
[]
[null,null,null,null,null,"Descuento:",0]
[]
[]
["2. INGRESE EL NOMBRE DE LA AGENCIA ASESORA:"]
[]
[null,null,"Intermediario:","Agente / Agencia"]
[]
[]
[]
["3. ESCOJA EL PRODUCTO PARA VISUALIZAR LA COTIZACION RESPECTIVA:"]

{"sheet":"Complete","index":1,"n_rows":65,"n_cols":10,"rows_kept":65,"cut":false,"hidden":false,"merged":[[64,3,66,9],[51,3,51,9],[72,0,72,1],[73,0,73,1],[71,0,71,1],[63,3,63,9],[55,0,55,1],[7,3,7,9],[8,3,8,9],[9,0,9,1],[40,0,40,1],[35,0,35,1],[30,0,30,1],[28,3,28,9],[39,3,39,9],[11,4,11,9],[13,4,13,9],[15,0,15,1],[21,0,21,1],[23,3,23,9]]}
[]
[]
[]
[]
[]
[]
[]
[null,null,null,"Cotización de Seguro Médico Internacional"]
[null,null,null,"Producto: Bupa Complete Care"]
["BUPA COMPLETE CARE"]
[]
[null,null,null,"Nombre del Asegurado:",{"$f":"+'INGRESO DE DATOS'!$D$12","v":"Nombre"}]
[]
[null,null,null,"Intermediario:",{"$f":"+'INGRESO DE DATOS'!$D$23","v":"Agente / Agencia"}]
[]
[null,null,null,"Fecha:",{"$f":"+TODAY()","v":"2021-12-20"},null,{"$f":"IF('INGRESO DE DATOS'!G18>0,\"Descuento\",\"\")","v":""},{"$f":"IF('INGRESO DE DATOS'!G18>0,'INGRESO DE DATOS'!G18,\"\")","v":""}]
[]
[null,null,null,null,null,"Numero de Adultos:",{"$f":"+'INGRESO DE DATOS'!G14","v":2},null,"Edad de Titular:",{"$f":"+'INGRESO DE DATOS'!$G$16","v":65}]
[]
[null,null,null,null,null,"Numero de Hijos:",{"$f":"+'INGRESO DE DATOS'!$J$14","v":3},null,"Edad de Conyuge:",{"$f":"+'INGRESO DE DATOS'!$J$16","v":18}]
[null,null,null,null,null,null," "," "," "]
[null,null,null,null,null,null,null,"Complicaciones de Maternidad (+ $500,000)"]
[null,null,null,null,null,null,null,false]
[null,null,null,"Deducibles"]
[null,null,null,null,"PLAN 1","PLAN 2","PLAN 3","PLAN 4","PLAN 5","PLAN 6"]
[null,null,null,"Dentro del pais de residencia","n/a",1000,2000,5000,10000,20000]
[null,null,null,"Fuera del pais de residencia","n/a",2000,3000,5000,10000,20000]
[]
[null,null,null,"Tarifas Anuales"]
[null,null,null,"Prima Titular","n/a",{"$f":"VLOOKUP($J$18,Tablas!$A$6:$H$29,4,TRUE)","v":42627},{"$f":"VLOOKUP($J$18,Tablas!$A$6:$H$29,5,TRUE)","v":30133},{"$f":"VLOOKUP($J$18,Tablas!$A$6:$H$29,6,TRUE)","v":22612},{"$f":"VLOOKUP($J$18,Tablas!$A$6:$H$29,7,TRUE)","v":20003},{"$f":"VLOOKUP($J$18,Tablas!$A$6:$H$29,8,TRUE)","v":17004}]
{"$rows_left_out":36}
{"sheet":"Secure","index":2,"n_rows":70,"n_cols":12,"rows_kept":70,"cut":false,"hidden":false,"merged":[[69,3,71,9],[72,0,72,1],[68,3,68,9],[25,3,25,9],[30,3,30,9],[42,3,42,9],[33,0,33,1],[25,0,25,1],[38,0,38,1],[43,0,43,1],[54,0,54,1],[55,3,55,9],[70,0,70,1],[71,0,71,1],[7,3,7,9],[8,3,8,9],[19,0,19,1],[9,3,9,8],[9,0,9,1],[11,4,11,9],[13,4,13,9],[13,0,13,1]]}
[]
[]
[]
[]
[]
[]
[]
[null,null,null,"Cotización de Seguro Médico Internacional"]
[null,null,null,"Producto: Bupa Secure Care "]
["BUPA SECURE CARE",null,null,null,null,null,null,null,null,null," "]
[null,null,null,null,null,null,null,null,null,null," "," "]
[null,null,null,"Nombre del Asegurado:",{"$f":"+'INGRESO DE DATOS'!$D$12","v":"Nombre"}]
[]
[null,null,null,"Intermediario:",{"$f":"+'INGRESO DE DATOS'!$D$23","v":"Agente / Agencia"}]
[]
[null,null,null,"Fecha:",{"$f":"+TODAY()","v":"2021-12-20"},null,{"$f":"IF('INGRESO DE DATOS'!G18>0,\"Descuento\",\"\")","v":""},{"$f":"IF('INGRESO DE DATOS'!G18>0,'INGRESO DE DATOS'!G18,\"\")","v":""}]
[]
[null,null,null,null,null,"Numero de Adultos:",{"$f":"+'INGRESO DE DATOS'!$G$14","v":2},null,"Edad de Titular:",{"$f":"+'INGRESO DE DATOS'!$G$16","v":65}]
[]
[null,null,null,null,null,"Numero de Hijos:",{"$f":"+'INGRESO DE DATOS'!$J$14","v":3},null,"Edad de Conyuge:",{"$f":"+'INGRESO DE DATOS'!$J$16","v":18}]
[null,null,null,null,null,null," "," "," "]
[null,null,null,null,null,false,null,"Complicaciones de Maternidad (+ $500,000)"]
[]
[null,null,null,null,null,false,false,"Trasplante de Órganos (+ $500,000)"]
[]
[null,null,null,"Deducibles"]
[null,null,null,null,"PLAN 1","PLAN 2","PLAN 3","PLAN 4","PLAN 5","PLAN 6"]
[null,null,null,"Dentro del pais de residencia","n/a",1000,2000,5000,10000,20000]
[null,null,null,"Fuera del pais de residencia","n/a",2000,3000,5000,10000,20000]
[]
{"$rows_left_out":41}
{"sheet":"Premium","index":3,"n_rows":75,"n_cols":11,"rows_kept":75,"cut":false,"hidden":false,"merged":[[9,0,9,1],[11,4,11,9],[13,4,13,9],[7,3,7,9],[8,3,8,9],[27,3,27,9],[11,0,11,1],[17,0,17,1],[23,0,23,1],[74,3,76,9],[59,3,59,9],[73,0,73,1],[74,0,74,1],[75,0,75,1],[32,0,32,1],[32,3,32,9],[45,3,45,9],[73,3,73,9],[57,0,57,1],[38,0,38,1],[43,0,43,1]]}
[]
[]
[]
[]
[]
[]
[]
[null,null,null,"Cotización de Seguro Médico Internacional"]
[null,null,null,"Producto: Bupa Premium Care"]
["BUPA PREMIUM CARE"]
[null,null,null,null,null,null,null," "," "," "," "]
[null,null,null,"Nombre del Asegurado:",{"$f":"+'INGRESO DE DATOS'!$D$12","v":"Nombre"}]
[]
[null,null,null,"Intermediario:",{"$f":"+'INGRESO DE DATOS'!$D$23","v":"Agente / Agencia"}]
[]
[null,null,null,"Fecha:",{"$f":"+TODAY()","v":"2021-12-20"},null,{"$f":"IF('INGRESO DE DATOS'!G18>0,\"Descuento\",\"\")","v":""},{"$f":"IF('INGRESO DE DATOS'!G18>0,'INGRESO DE DATOS'!G18,\"\")","v":""}]
[]
[null,null,null,null,null,"Numero de Adultos:",{"$f":"+'INGRESO DE DATOS'!$G$14","v":2},null,"Edad de Titular:",{"$f":"+'INGRESO DE DATOS'!$G$16","v":65}]
[]
[null,null,null,null,null,"Numero de Hijos:",{"$f":"+'INGRESO DE DATOS'!$J$14","v":3},null,"Edad de Conyuge:",{"$f":"+'INGRESO DE DATOS'!$J$16","v":18}]
[null,null,null,null,null,null," "," "," "]
[null,null,null,null,null,null,null,"Complicaciones de Maternidad (+ $500,000)"]
[null,null,null,null,null,false]
[null,null,null,null,null,false,null,"Trasplante de Órganos (+ $500,000)"]
[null,null,null,null,null,false]
[null,null,null," ",null,null,null,"Eliminación de Deducible"]
[]
[null,null,null,"Deducibles"]
[null,null,null,null,"PLAN 1","PLAN 2","PLAN 3","PLAN 4","PLAN 5","PLAN 6"]
[null,null,null,"Dentro del pais de residencia","n/a",1000,2000,5000,10000,20000]
{"$rows_left_out":46}
{"sheet":"Advantage (LA)","index":4,"n_rows":50,"n_cols":13,"rows_kept":50,"cut":false,"hidden":true,"merged":[[9,0,9,12],[11,7,11,12],[13,7,13,12],[17,5,17,6],[16,5,16,6],[11,0,11,3],[17,0,18,1],[12,0,12,1],[13,0,13,1],[14,0,14,1],[15,0,15,1],[16,0,16,1],[49,5,49,12],[12,2,12,3],[13,2,13,3],[14,2,14,3],[15,2,15,3],[27,2,27,3],[16,2,16,3],[20,2,20,3],[17,2,18,3],[29,2,29,3],[30,2,30,3],[23,2,23,3],[24,2,24,3],[19,2,19,3],[33,2,33,3],[45,2,46,3],[19,0,19,1],[28,0,28,1],[28,2,28,3],[32,0,32,1],[25,2,25,3],[25,0,25,1],[26,0,26,1],[26,2,26,3],[32,2,32,3],[21,2,21,3],[22,2,22,3],[31,2,31,3],[27,0,27,1],[29,0,29,1],[30,0,31,1],[20,0,21,1],[22,0,23,1],[24,0,24,1],[33,0,33,1],[34,0,34,1],[38,2,38,3],[38,0,38,1],[35,0,35,1],[35,2,35,3],[36,0,36,1],[36,2,36,3],[34,2,34,3],[39,0,39,1],[40,0,40,1],[39,2,39,3],[41,0,41,1],[40,2,40,3],[45,0,46,1],[42,0,42,1],[41,2,41,3],[42,2,42,3],[43,0,43,1],[43,2,43,3],[44,0,44,1],[44,2,44,3]]}
[]
[null,null,null,null,null,null,null,null,null," "," "," "]
[]
[]
[]
[null,null,null,null,null,null,null,null,null," "," "," "," "]
[]
[]
[]
["Cotización de Seguro Médico Internacional - Bupa ADVANTAGE Care (cobertura solo Latinoamérica)"]
[]
["Bupa Advantage Care (cobertura solo en Latinoamérica)",null,null,null,null,null,null,{"$f":"+'INGRESO DE DATOS'!$D$12","v":"Nombre"}]
["Cobertura Máxima anual",null,"US $ 3,500,000"]
["Cobertura Geografica",null,"Limitada a Latinoamérica excluyendo México",null,null,null,null,{"$f":"+'INGRESO DE DATOS'!$D$23","v":"Agente / Agencia"}]
["Condiciones médicas cubiertas",null,"Todas las condiciones médicas"]
["Redes de proveedores",null,"Red de Proveedores \"Bupa Advantage\"",null,null,null,null,null,null,{"$f":"+'INGRESO DE DATOS'!$G$14","v":2},null,null,{"$f":"+'INGRESO DE DATOS'!$G$16","v":65}]
["Opciones fuera de la Red",null,"NO, solo en casos de emergencia",null,null,"FECHA DE COTIZACION :"]
["Requiere preautorización",null,"SI, 30% de penalización por omitir prenotificación",null,null,{"$f":"NOW()","v":"2021-12-20T18:27:15.930"},null,null,null,{"$f":"+'INGRESO DE DATOS'!$J$14","v":3},null,null,{"$f":"+'INGRESO DE DATOS'!$J$16","v":18}]
[null,null,null,null,null,null,null,null,null," "," "," "]
["Número máximo de días de hospitalización",null,"Ilimitado",null,null,null,null,null,true,null,"COMPLICACIONES DE MATERNIDAD"]
["Habitación y alimentación",null,"100% dentro de Red Bupa"]
[null,null,"\"UCR\" para L.A. en emergencias fuera de  Red Bupa",null,null,null,null,null,true,null,"TRASPLANTE DE ORGANOS"]
["Cuidados Intensivos",null,"100% dentro de Red Bupa"]
[null,null,"\"UCR\" para L.A. en emergencias fuera de  Red Bupa",null,null,null," "]
["Cobertura de Maternidad",null,"$5,000 (Excepto planes 4,5, y 6)",null,null,"Deducibles",null,"PLAN 1","PLAN 2","PLAN 3","PLAN 4","PLAN 5","PLAN 6"]
["Cobertura Provisional de Recién Nacido",null,"$30,000 por los primeros 90 días",null,null,"Dentro del pais de residencia",null,"n/a",1000,2000,5000,10000,20000]
["Cuidado del Recién Nacido saludable",null,"Ya incluída dentro del beneficio de Maternidad",null,null,"Fuera del pais de residencia",null,"n/a",2000,3000,5000,10000,20000]
["Cobertura de Complicaciones de Maternidad",null,"Disponible a través de cobertura opcional adicional"]
["Trasplante de Organos",null,"$1,000,000 de por vida, por diagnóstico"]
["Condiciones congénitas y hereditarias",null,"<18 años $300,000 de por vida; >=18 al 100%",null,null,"Tarifas Anuales"]
{"$rows_left_out":21}
{"sheet":"Blue 500","index":5,"n_rows":53,"n_cols":13,"rows_kept":53,"cut":false,"hidden":true,"merged":[[9,0,9,12],[11,7,11,12],[13,7,13,12],[17,5,17,6],[16,5,16,6],[11,0,11,3],[17,0,18,1],[12,0,12,1],[13,0,13,1],[14,0,14,1],[15,0,15,1],[16,0,16,1],[51,5,51,12],[12,2,12,3],[13,2,13,3],[14,2,14,3],[15,2,15,3],[27,2,27,3],[16,2,16,3],[20,2,20,3],[17,2,18,3],[29,2,29,3],[30,2,30,3],[23,2,23,3],[24,2,24,3],[19,2,19,3],[33,2,33,3],[43,2,43,3],[19,0,19,1],[28,0,28,1],[28,2,28,3],[32,0,32,1],[25,2,25,3],[25,0,25,1],[26,0,26,1],[26,2,26,3],[32,2,32,3],[21,2,21,3],[22,2,22,3],[31,2,31,3],[27,0,27,1],[29,0,29,1],[30,0,31,1],[20,0,21,1],[22,0,23,1],[24,0,24,1],[35,2,40,3],[33,0,33,1],[34,0,34,1],[35,0,42,1],[41,2,42,3],[43,0,43,1],[34,2,34,3],[48,2,49,3],[48,0,49,1],[46,2,46,3],[47,2,47,3],[44,2,44,3],[46,0,46,1],[47,0,47,1],[44,0,44,1],[45,0,45,1],[45,2,45,3]]}
[]
[null,null,null,null,null,null,null,null,null," "," "," "]
[]
[]
[]
[null,null,null,null,null,null,null,null,null," "," "," "," "]
[]
[]
[]
["Cotización de Seguro Médico Internacional - Bupa Blue 500 Guatemala"]
[]
["Bupa Blue 500 Guatemala",null,null,null,null,null,null,{"$f":"+'INGRESO DE DATOS'!$D$12","v":"Nombre"}]
["Cobertura Máxima anual",null,"US$500,000"]
["Cobertura Geografica",null,"Cobertura mundial",null,null,null,null,{"$f":"+'INGRESO DE DATOS'!$D$23","v":"Agente / Agencia"}]
["Condiciones médicas cubiertas",null,"Todas las condiciones médicas"]
["Redes de proveedores",null,"Red de Proveedores Alpha",null,null,null,null,null,null,{"$f":"+'INGRESO DE DATOS'!$G$14","v":2},null,null,{"$f":"+'INGRESO DE DATOS'!$G$16","v":65}]
["Opciones fuera de la Red",null,"30%/70%",null,null,"FECHA DE COTIZACION :"]
["Requiere preautorización",null,"SI, 30% de penalización por omitir prenotificación",null,null,{"$f":"NOW()","v":"2021-12-20T18:27:15.930"},null,null,null,{"$f":"+'INGRESO DE DATOS'!$J$14","v":3},null,null,{"$f":"+'INGRESO DE DATOS'!$J$16","v":18}]
[null,null,null,null,null,null,null,null,null," "," "," "]
["Número máximo de días de hospitalización",null,"Ilimitado",null,null,null,null,null,true,null,"COMPLICACIONES DE MATERNIDAD"]
["Habitación y alimentación",null,"100% dentro de Red Bupa"]
[null,null,"70% fuera de la Red Bupa",null,null,null,null,null,true,null,"TRASPLANTE DE ORGANOS"]
["Cuidados Intensivos",null,"100% dentro de Red Bupa"]
[null,null,"70% fuera de la Red Bupa",null,null,null," "]
["Cobertura de Maternidad",null,"$3,500 (Excepto planes 4,5, y 6)",null,null,"Deducibles",null,null,"PLAN 1","PLAN 2","PLAN 3","PLAN 4","PLAN 5"]
["Cobertura Provisional de Recién Nacido",null,"$10,000 por los primeros 90 días",null,null,"Dentro del pais de residencia",null,null,250,500,1000,2000,5000]
["Cuidado del Recién Nacido saludable",null,"2 visitas por año/ $50 vacunas",null,null,"Fuera del pais de residencia",null,null,500,1000,2000,4000,5000]
["Cobertura de Complicaciones de Maternidad",null,50000]
["Trasplante de Organos",null,250000]
["Condiciones congénitas y hereditarias",null,"<18 años $75,000 de por vida; >=18 al 100%",null,null,"Tarifas Anuales"]
{"$rows_left_out":24}
{"sheet":"Blue 100","index":6,"n_rows":53,"n_cols":13,"rows_kept":53,"cut":false,"hidden":true,"merged":[[13,0,13,1],[13,2,13,3],[13,7,13,12],[9,0,9,12],[11,0,11,3],[11,7,11,12],[12,0,12,1],[12,2,12,3],[14,0,14,1],[14,2,14,3],[15,0,15,1],[15,2,15,3],[16,0,16,1],[16,2,16,3],[16,5,16,6],[17,0,18,1],[17,2,18,3],[17,5,17,6],[19,0,19,1],[19,2,19,3],[20,0,21,1],[20,2,20,3],[21,2,21,3],[22,0,23,1],[22,2,22,3],[23,2,23,3],[24,0,24,1],[24,2,24,3],[25,0,25,1],[25,2,25,3],[26,0,26,1],[26,2,26,3],[27,0,27,1],[27,2,27,3],[28,0,28,1],[28,2,28,3],[29,0,29,1],[29,2,29,3],[43,0,43,1],[43,2,43,3],[30,0,31,1],[30,2,30,3],[31,2,31,3],[32,0,32,1],[32,2,32,3],[33,0,33,1],[33,2,33,3],[34,0,34,1],[34,2,34,3],[35,0,42,1],[35,2,40,3],[41,2,42,3],[44,0,44,1],[44,2,44,3],[45,0,45,1],[45,2,45,3],[46,0,46,1],[46,2,46,3],[47,0,47,1],[47,2,47,3],[48,0,49,1],[48,2,49,3],[51,5,51,12]]}
[]
[null,null,null,null,null,null,null,null,null," "," "," "]
[]
[]
[]
[null,null,null,null,null,null,null,null,null," "," "," "," "]
[]
[]
[]
["Cotización de Seguro Médico Internacional - Bupa Blue 100 Guatemala"]
[]
["Bupa Blue 100 Guatemala",null,null,null,null,null,null,{"$f":"+'INGRESO DE DATOS'!$D$12","v":"Nombre"}]
["Cobertura Máxima anual",null,"US$100,000"]
["Cobertura Geografica",null,"Cobertura mundial",null,null,null,null,{"$f":"+'INGRESO DE DATOS'!$D$23","v":"Agente / Agencia"}]
["Condiciones médicas cubiertas",null,"Todas las condiciones médicas"]
["Redes de proveedores",null,"Red de Proveedores Alpha",null,null,null,null,null,null,{"$f":"+'INGRESO DE DATOS'!$G$14","v":2},null,null,{"$f":"+'INGRESO DE DATOS'!$G$16","v":65}]
["Opciones fuera de la Red",null,"30%/70%",null,null,"FECHA DE COTIZACION :"]
["Requiere preautorización",null,"Sí, 30% de penalización por omitir prenotificación",null,null,{"$f":"NOW()","v":"2021-12-20T18:27:15.930"},null,null,null,{"$f":"+'INGRESO DE DATOS'!$J$14","v":3},null,null,{"$f":"+'INGRESO DE DATOS'!$J$16","v":18}]
[null,null,null,null,null,null,null,null,null," "," "," "]
["Número máximo de días de hospitalización",null,"Ilimitado",null,null,null,null,null,true,null,"COMPLICACIONES DE MATERNIDAD"]
["Habitación y alimentación",null,"100% dentro de Red Bupa"]
[null,null,"70% fuera de la Red Bupa",null,null,null,null,null,true,null,"TRASPLANTE DE ORGANOS"]
["Cuidados Intensivos",null,"100% dentro de Red Bupa"]
[null,null,"70% fuera de la Red Bupa",null,null,null," "]
["Cobertura de Maternidad",null,"$3,500 (Excepto planes 4,5, y 6)",null,null,"Deducibles",null,null,"PLAN 1","PLAN 2","PLAN 3","PLAN 4","PLAN 5"]
["Cobertura Provisional de Recién Nacido",null,"$7,500 por los primeros 90 días",null,null,"Dentro del pais de residencia",null,null,250,500,1000,2000,5000]
["Cuidado del Recién Nacido saludable",null,"2 visitas por año. $50 vacunas",null,null,"Fuera del pais de residencia",null,null,500,1000,2000,4000,5000]
["Cobertura de Complicaciones de Maternidad",null,25000]
["Trasplante de Organos",null,100000]
["Condiciones congénitas y hereditarias",null,"<18 años $50,000 de por vida; >=18 al 100%",null,null,"Tarifas Anuales"]
{"$rows_left_out":24}
{"sheet":"Classic","index":7,"n_rows":75,"n_cols":10,"rows_kept":75,"cut":false,"hidden":false,"merged":[[18,0,18,1],[74,3,76,9],[59,3,59,9],[69,0,69,1],[70,0,70,1],[71,0,71,1],[7,0,7,1],[73,3,73,9],[11,4,11,9],[13,4,13,9],[56,0,56,1],[27,3,27,9],[32,3,32,9],[45,3,45,9],[12,0,12,1],[43,0,43,1],[38,0,38,1],[24,0,24,1],[7,3,7,9],[8,3,8,9],[9,0,9,1],[32,0,32,1]]}
[]
[]
[]
[]
[]
[]
[]
[null,null,null,"Cotización de Seguro Médico Internacional"]
[null,null,null,"Bupa Classic Care"]
["BUPA CLASSIC CARE"]
[]
[null,null,null,"Nombre del Asegurado:",{"$f":"+'INGRESO DE DATOS'!$D$12","v":"Nombre"}]
[]
[null,null,null,"Intermediario:",{"$f":"+'INGRESO DE DATOS'!$D$23","v":"Agente / Agencia"}]
[]
[null,null,null,"Fecha:",{"$f":"+TODAY()","v":"2021-12-20"},null,{"$f":"IF('INGRESO DE DATOS'!G18>0,\"Descuento\",\"\")","v":""},{"$f":"IF('INGRESO DE DATOS'!G18>0,'INGRESO DE DATOS'!G18,\"\")","v":""}]
[]
[null,null,null,null,null,"Numero de Adultos:",{"$f":"+'INGRESO DE DATOS'!$G$14","v":2},null,"Edad de Titular:",{"$f":"+'INGRESO DE DATOS'!$G$16","v":65}]
[]
[null,null,null,null,null,"Numero de Hijos:",{"$f":"+'INGRESO DE DATOS'!$J$14","v":3},null,"Edad de Conyuge:",{"$f":"+'INGRESO DE DATOS'!$J$16","v":18}]
[null,null,null,null,null,null," "," "," "]
[null,null,null,null,null,null,null,"Complicaciones de Maternidad (+ $500,000)"]
[null,null,null,null,null,false]
[null,null,null,null,null,false,null,"Trasplante de Órganos (+ $500,000)"]
[null,null,null,null,null,false]
[null,null,null,null,null,null,null,"Eliminación de Deducible"]
[]
[null,null,null,"Deducibles"]
[null,null,null,null,"PLAN 1","PLAN 2","PLAN 3","PLAN 4","PLAN 5","PLAN 6"]
[null,null,null,"Dentro del pais de residencia","n/a",1000,2000,5000,10000,20000]
{"$rows_left_out":46}
{"sheet":"Resumen tarifas anuales","index":8,"n_rows":107,"n_cols":9,"rows_kept":107,"cut":false,"hidden":false,"merged":[[74,2,74,8],[75,2,76,2],[60,2,60,8],[66,2,66,8],[67,2,67,3],[70,2,70,8],[71,2,72,2],[50,2,50,8],[51,2,52,2],[54,2,54,8],[55,2,56,2],[59,2,59,8],[35,2,36,2],[39,2,39,8],[40,2,40,8],[46,2,46,8],[47,2,47,3],[0,0,0,8],[101,2,102,8],[95,2,96,2],[6,3,6,8],[8,3,8,8],[14,1,14,2],[13,1,13,2],[80,2,80,8],[79,2,79,8],[19,2,19,8],[20,2,20,8],[26,2,26,8],[27,2,27,3],[30,2,30,8],[31,2,32,2],[34,2,34,8],[104,2,104,8],[105,2,105,8],[106,2,106,8],[86,2,86,8],[100,2,100,8],[90,2,90,8],[91,2,92,2],[87,2,87,3],[94,2,94,8]]}
["Cotización de Seguro Médico Internacional - BUPA Guatemala"]
[null,null,null,null,null," "," "," "]
[]
[]
[null,null,null,null,null," "," "," "," "]
[]
[null,null,"Nombre del Asegurado:",{"$f":"+'INGRESO DE DATOS'!$D$12","v":"Nombre"}]
[]
[null,null,"Intermediario:",{"$f":"+'INGRESO DE DATOS'!$D$23","v":"Agente / Agencia"}]
[]
[null,null,"Fecha:",{"$f":"+TODAY()","v":"2021-12-20"},null,{"$f":"IF('INGRESO DE DATOS'!G18>0,\"Descuento\",\"\")","v":""},{"$f":"IF('INGRESO DE DATOS'!G18>0,'INGRESO DE DATOS'!G18,\"\")","v":""}]
[]
[null,null,null,null,"Numero de Adultos:",{"$f":"+'INGRESO DE DATOS'!$G$14","v":2},null,"Edad de Titular:",{"$f":"+'INGRESO DE DATOS'!$G$16","v":65}]
[]
[null,null,null,null,"Numero de Hijos:",{"$f":"+'INGRESO DE DATOS'!$J$14","v":3},null,"Edad de Conyuge:",{"$f":"+'INGRESO DE DATOS'!$J$16","v":18}]
[null,null,null,null,null," "," "," "]
[]
[]
[]
[null,null,"COMPLETE CARE"]
[null,null,"Deducibles"]
[null,null,null,"PLAN 1","PLAN 2","PLAN 3","PLAN 4","PLAN 5","PLAN 6"]
[null,null,"Dentro del pais de residencia","n/a",1000,2000,5000,10000,20000]
[null,null,"Fuera del pais de residencia","n/a",2000,3000,5000,10000,20000]
[]
[]
[null,null,"Tarifas Anuales"]
[null,null,"Complete Care",null,{"$f":"+Complete!F38","v":68122.880000000005},{"$f":"+Complete!G38","v":48135.360000000001},{"$f":"+Complete!H38","v":35906.080000000002},{"$f":"+Complete!I38","v":30372.16},{"$f":"+Complete!J38","v":25045.439999999999}]
[]
[]
{"$rows_left_out":78}
{"sheet":"Tablas","index":9,"n_rows":1133,"n_cols":26,"rows_kept":1133,"cut":false,"hidden":true,"merged":[[847,0,847,1],[847,2,847,6],[773,0,773,7],[774,0,774,7],[775,0,775,1],[775,2,775,6],[846,0,846,7],[629,0,629,7],[630,0,630,1],[630,2,630,6],[701,0,701,7],[702,0,702,1],[702,2,702,6],[343,2,343,6],[415,0,415,7],[555,0,555,7],[556,0,556,1],[556,2,556,6],[343,0,343,1],[449,0,449,7],[450,0,450,1],[450,2,450,6],[416,0,416,7],[417,0,417,1],[417,2,417,6],[628,0,628,7],[482,0,482,7],[483,0,483,7],[484,0,484,1],[484,2,484,6],[68,0,68,7],[102,0,102,7],[103,0,103,1],[103,2,103,6],[342,0,342,7],[269,0,269,7],[270,0,270,7],[271,0,271,1],[271,2,271,6],[170,2,170,6],[202,0,202,7],[236,0,236,7],[237,0,237,1],[237,2,237,6],[204,0,204,1],[204,2,204,6],[136,0,136,7],[137,0,137,1],[137,2,137,6],[169,0,169,7],[170,0,170,1],[918,0,918,7],[919,0,919,7],[920,0,920,1],[920,2,920,6],[1,0,1,7],[2,0,2,7],[36,0,36,1],[36,2,36,6],[35,0,35,7],[3,0,3,1],[3,2,3,6],[135,0,135,7],[69,0,69,7],[70,0,70,1],[70,2,70,6],[203,0,203,7],[952,0,952,7],[953,0,953,7],[954,0,954,1],[954,2,954,6],[986,0,986,7],[1062,0,1062,1],[1062,2,1062,6],[987,0,987,7],[988,0,988,1],[988,2,988,6],[1060,0,1060,7],[1061,0,1061,7]]}
[]
["BUPA COMPLETE GUATEMALA",null,null,null,null,null,null,null,null,"FACTOR SEMESTRAL :",null,0.53]
["TARIFAS ANUALES",null,null,null,null,null,null,null,null,"FACTOR TRIMESTRAL :",null,0.27500000000000002]
["EDAD"]
[" "," ","DW1","DW2","DW3","DW4","DW5","DW6"]
[18,"-  24",16474,10023,6865,4819,3326,2542,null,"Descuento (15%)",null,1,null,10791,6565,4496,3238,2294,1753,null,true,true,true,true,true,true]
[25,"-  29",17299,10501,7622,5355,3649,2804,null,null,null,null,null,11330,6878,4992,3598,2518,1934,null,true,true,true,true,true,true]
[30,"-  34",18056,10985,8168,5957,4435,3392,null,null,null,null,null,11826,7194,5350,4003,3059,2340,null,true,true,true,true,true,true]
[35,"-  39",20181,12290,9131,6690,4954,3783,null,null,null,null,null,13218,8049,5980,4496,3418,2609,null,true,true,true,true,true,true]
[40,"-  44",22858,14276,10023,7428,5475,4171,null,null,null,null,null,14972,9351,6565,4992,3777,2878,null,true,true,true,true,true,true]
[45,"-  49",25536,15927,11190,8295,6127,4693,null,null,null,null,null,16726,10432,7329,5575,4227,3238,null,true,true,true,true,true,true]
[50,"-  54",33704,20798,14760,10906,8733,6715,null,null,null,null,null,22076,13623,9667,7329,6026,4633,null,true,true,true,true,true,true]
[55,"-  59",35830,22170,15719,11641,9317,7104,null,null,null,null,null,23469,14521,10296,7823,6429,4901,null,true,true,true,true,true,true]
[60,null,38027,24094,17094,13246,11077,8926,null,null,null,null,null,24908,15781,11196,8902,7644,6159,null,true,true,true,true,true,true]
[61,null,40841,25877,18331,14183,11925,9580,null,null,null,null,null,26752,16949,12006,9532,8229,6610,null,true,true,true,true,true,true]
[62,null,44685,28348,20045,15522,13029,10489,null,null,null,null,null,29269,18568,13129,10432,8991,7238,null,true,true,true,true,true,true]
[63,null,47500,30133,21347,16526,13880,11141,null,null,null,null,null,31113,19737,13982,11106,9577,7688,null,true,true,true,true,true,true]
[64,null,51412,32604,23065,17865,14987,12055,null,null,null,null,null,33676,21356,15107,12006,10342,8319,null,true,true,true,true,true,true]
[65,null,53879,42627,30133,22612,20003,17004,null,null,null,null,null,35292,27921,19737,15197,13803,11734,null,true,true,true,true,true,true]
[66,null,56283,49557,35008,26289,23261,19740,null,null,null,null,null,36866,32461,22930,17669,16052,13623,null,true,true,true,true,true,true]
[67,null,61500,54088,38234,28696,25410,21566,null,null,null,null,null,40284,35429,25043,19287,17535,14882,null,true,true,true,true,true,true]
[68,null,68020,59921,42350,31775,28145,23911,null,null,null,null,null,44555,39249,27739,21356,19423,16501,null,true,true,true,true,true,true]
[69,null,74812,65894,46539,34987,30946,26254,null,null,null,null,null,49004,43162,30483,23514,21356,18118,null,true,true,true,true,true,true]
[70,null,88544,81129,56694,41138,36028,30881,null,null,null,null,null,57999,53142,37136,27649,24863,21311,null,true,true,true,true,true,true]
[71,null,92045,84287,58894,42747,37462,32120,null,null,null,null,null,60292,55210,38577,28730,25853,22166,null,true,true,true,true,true,true]
[72,null,94652,86689,60608,43950,38503,33032,null,null,null,null,null,62000,56784,39699,29539,26571,22795,null,true,true,true,true,true,true]
[73,null,98083,89847,62806,45558,39935,34269,null,null,null,null,null,64248,58852,41139,30619,27560,23649,null,true,true,true,true,true,true]
[74,null,99866,91495,63903,46426,40653,34856,null,null,null,null,null,65416,59932,41858,31203,28055,24054,null,true,true,true,true,true,true]
[75,"o más",104193,95475,66715,48429,42413,36353,null,null,null,null,null,68249,62539,43700,32550,29269,25088,null,true,true,true,true,true,true]
[1,"Hijo",5561,3504,2541,1944,1631,1174,null,null,null,null,null,3641,2294,1664,1305,1125,809,null,true,true,true,true,true,true]
{"$rows_left_out":1103}