{"text_format":"1","workbook":"xlsx","n_sheets":4,"sheets":["INGRESO DE DATOS","Global Premier","Resumen tarifas","Tablas"],"not_rendered":{"charts":0,"images":5,"macros":1,"external_links":0,"defined_names":2,"comments":1,"pivot_tables":0},"unopened":[],"bounds":{"document_bytes":16777216,"sheet_cells":100000,"rows_first":2000,"rows_last":500,"rows_between":2000,"halvings":0,"cell_chars":16384,"cell_head_chars":4096},"cells_cut":0,"cells_raw":0,"read":"whole","date_system":"1900"}

{"sheet":"INGRESO DE DATOS","index":0,"n_rows":26,"n_cols":9,"rows_kept":26,"cut":false,"hidden":false,"merged":[[9,0,9,7],[23,3,23,4],[23,6,23,7],[18,5,18,6],[14,1,14,2],[16,1,16,2],[14,3,14,7],[16,5,16,6],[18,1,18,2]]}
[]
[null,null,null,null,null,null,null," "," "]
[]
[]
[]
[]
[]
[]
[]
["(Para renovaciones de pólizas emitidas en 2020)"]
[]
[]
["1.   LLENE LA INFORMACIÓN DEL ASEGURADO PROPUESTO:"]
[]
[null,"Nombre del Asegurado Titular:",null,"NOMBRE COMPLETO"]
[]
[null,"Número de adultos en la póliza:",null,2,null,"Número de niños en la póliza:",null,2]
[]
[null,"Edad del Asegurado Titular:",null,32,null,"Edad del/la cónyuge :",null,46]
[]
[]
[]
[]
[]
[]
[null,1,null,1]

{"sheet":"Global Premier","index":1,"n_rows":62,"n_cols":10,"rows_kept":62,"cut":false,"hidden":false,"merged":[[15,0,15,1],[52,4,52,5],[53,4,53,5],[28,4,28,9],[37,4,37,9],[48,4,48,9],[16,3,16,4],[18,3,18,4],[20,3,20,4],[16,5,16,8],[43,1,44,1],[60,4,60,9],[59,4,59,9],[61,4,62,9],[46,4,46,5],[43,0,44,0]]}
[]
[]
[]
[null,null,null,null,null,null,null," "," "," "]
[]
[]
[]
[]
[]
[]
[]
[]
[]
[]
[]
["GLOBAL PREMIER HEALTH PLAN"]
[null,null,null,"Nombre del Asegurado Titular:",null,{"$f":"+'INGRESO DE DATOS'!$D$15","v":"NOMBRE COMPLETO"}]
[]
[null,null,null,"Número de adultos en la póliza:",null,{"$f":"+'INGRESO DE DATOS'!$D$17","v":2},null,"Edad del Asegurado Titular:",{"$f":"+'INGRESO DE DATOS'!$D$19","v":32}]
[]
[null,null,null,"Número de niños en la póliza:",null,{"$f":"+'INGRESO DE DATOS'!$H$17","v":2},null,"Edad del/la conyuge:",{"$f":"+'INGRESO DE DATOS'!$H$19","v":46}]
[null,null,null,null,null,null,null," "," "]
[null,null,null,null,null,null,null,"Fecha de la cotización:",{"$f":"NOW()","v":"2021-12-20T11:33:26.690"}]
[null,null,null,null,null,null," ",false,null," "]
[null,null,null,null,"Deducibles",null,"PLAN 1","PLAN 2","PLAN 3","PLAN 4"]
[null,null,null,null,"En el país de residencia",null,250,2000,5000,10000]
[null,null,null,null,"Fuera del país de residencia",null,5000,2000,5000,10000]
[]
[null,null,null,null,"Tarifas anuales"]
[null,null,null,null,"Prima para Asegurado Titular",null,{"$f":"VLOOKUP($I$19,Tablas!$A$155:$G$221,3,TRUE)","v":5105.95},{"$f":"VLOOKUP($I$19,Tablas!$A$155:$G$221,4,TRUE)","v":4634.2},{"$f":"VLOOKUP($I$19,Tablas!$A$155:$G$221,5,TRUE)","v":3343.0499999999997},{"$f":"VLOOKUP($I$19,Tablas!$A$155:$G$221,6,TRUE)","v":2419.9499999999998}]
[null,null,null,null,"Prima para conyuge",null,{"$f":"IF($F$19=1,0,(VLOOKUP($I$21,Tablas!$A$155:$G$221,3,TRUE)))","v":7002.3},{"$f":"IF($F$19=1,0,(VLOOKUP($I$21,Tablas!$A$155:$G$221,4,TRUE)))","v":6354.5999999999995},{"$f":"IF($F$19=1,0,(VLOOKUP($I$21,Tablas!$A$155:$G$221,5,TRUE)))","v":4484.5999999999995},{"$f":"IF($F$19=1,0,(VLOOKUP($I$21,Tablas!$A$155:$G$221,6,TRUE)))","v":3245.2999999999997}]
[null,null,null,null,"Prima para hijo (s)",null,{"$f":"IF($F$21=0,0,(VLOOKUP($F$21,Tablas!$A$222:$G$224,3,TRUE)))","v":3092.2999999999997},{"$f":"IF($F$21=0,0,(VLOOKUP($F$21,Tablas!$A$222:$G$224,4,TRUE)))","v":2805},{"$f":"IF($F$21=0,0,(VLOOKUP($F$21,Tablas!$A$222:$G$224,5,TRUE)))","v":2098.65},{"$f":"IF($F$21=0,0,(VLOOKUP($F$21,Tablas!$A$222:$G$224,6,TRUE)))","v":1520.6499999999999}]
[null,null,null,null,"Total de Prima neta",null,{"$f":"SUM(G30:G32)","v":15200.55},{"$f":"SUM(H30:H32)","v":13793.8},9926.2999999999993,{"$f":"SUM(J30:J32)","v":7185.9}]
[null,null,null,null,"Tarifa administrativa anual",null,75,75,75,75]
[null,null,null,null,"IVA (12%)",null,{"$f":"(G33+G34)*12%","v":1833.0659999999998},{"$f":"(H33+H34)*12%","v":1664.2559999999999},1200.1559999999999,{"$f":"(J33+J34)*12%","v":871.30799999999988}]
[null,null,null,null,"TOTAL ANUAL",null,{"$f":"SUM(G33:G35)","v":17108.615999999998},{"$f":"SUM(H33:H35)","v":15533.055999999999},{"$f":"SUM(I33:I35)","v":11201.455999999998},{"$f":"SUM(J33:J35)","v":8132.2079999999996}]
[]
[null,null,null,null,"Tarifas semi anuales"]
[null,null,null,null,"Prima para Asegurado Titular",null,{"$f":"VLOOKUP($I$19,Tablas!$A$530:$G$596,3,TRUE)","v":2706.1534999999999},{"$f":"VLOOKUP($I$19,Tablas!$A$530:$G$596,4,TRUE)","v":2456.1260000000002},{"$f":"VLOOKUP($I$19,Tablas!$A$530:$G$596,5,TRUE)","v":1771.8164999999999},{"$f":"VLOOKUP($I$19,Tablas!$A$530:$G$596,6,TRUE)","v":1282.5735}]
[null,null,null,null,"Prima para conyuge",null,{"$f":"IF($F$19=1,0,(VLOOKUP($I$21,Tablas!$A$530:$G$596,3,TRUE)))","v":3711.2190000000005},{"$f":"IF($F$19=1,0,(VLOOKUP($I$21,Tablas!$A$530:$G$596,4,TRUE)))","v":3367.9380000000001},{"$f":"IF($F$19=1,0,(VLOOKUP($I$21,Tablas!$A$530:$G$596,5,TRUE)))","v":2376.8379999999997},{"$f":"IF($F$19=1,0,(VLOOKUP($I$21,Tablas!$A$530:$G$596,6,TRUE)))","v":1720.009}]
[null,null,null,null,"Prima para hijo (s)",null,{"$f":"IF($F$21=0,0,(VLOOKUP($F$21,Tablas!$A$597:$G$599,3,TRUE)))","v":1638.9189999999999},{"$f":"IF($F$21=0,0,(VLOOKUP($F$21,Tablas!$A$597:$G$599,4,TRUE)))","v":1486.65},{"$f":"IF($F$21=0,0,(VLOOKUP($F$21,Tablas!$A$597:$G$599,5,TRUE)))","v":1112.2845000000002},{"$f":"IF($F$21=0,0,(VLOOKUP($F$21,Tablas!$A$597:$G$599,6,TRUE)))","v":805.94449999999995}]
[null,null,null,null,"Total de Prima neta",null,{"$f":"SUM(G39:G41)","v":8056.2915000000003},{"$f":"SUM(H39:H41)","v":7310.7139999999999},{"$f":"SUM(I39:I41)","v":5260.9390000000003},{"$f":"SUM(J39:J41)","v":3808.527}]
[null,null,null,null,"Tarifa administrativa anual",null,75,75,75,75]
[null,null,null,null,"IVA (12%)",null,{"$f":"(G42+G43)*12%","v":975.75498000000005},{"$f":"(H42+H43)*12%","v":886.28567999999996},640.31268,{"$f":"(J42+J43)*12%","v":466.02323999999999}]
[null,null,null,null,"TOTAL de primera cuota",null,{"$f":"SUM(G42:G44)","v":9107.0464800000009},{"$f":"SUM(H42:H44)","v":8271.9996800000008},{"$f":"SUM(I42:I44)","v":5976.2516800000003},{"$f":"SUM(J42:J44)","v":4349.5502400000005}]
[null,null,null,null,"Costo de segunda cuota",null,{"$f":"G42+G44 - G43*12%","v":9023.0464800000009},{"$f":"H42+H44 - H43*12%","v":8187.9996800000008},5892.2516800000003,{"$f":"J42+J44 - J43*12%","v":4265.5502400000005}]
[null,null,null,null,"TOTAL ANUAL",null,{"$f":"G45+G46","v":18130.092960000002},{"$f":"H45+H46","v":16459.999360000002},11868.503360000001,{"$f":"J45+J46","v":8615.100480000001}]
[]
[null,null,null,null,"Tarifas trimestrales"]
[null,null,null,null,"Prima para Asegurado Titular",null,{"$f":"VLOOKUP($I$19,Tablas!$A$755:$G$821,3,TRUE)","v":1404.13625},{"$f":"VLOOKUP($I$19,Tablas!$A$755:$G$821,4,TRUE)","v":1274.405},{"$f":"VLOOKUP($I$19,Tablas!$A$755:$G$821,5,TRUE)","v":919.33875},{"$f":"VLOOKUP($I$19,Tablas!$A$755:$G$821,6,TRUE)","v":665.48625000000004}]
[null,null,null,null,"Prima para conyuge",null,{"$f":"IF($F$19=1,0,(VLOOKUP($I$21,Tablas!$A$755:$G$821,3,TRUE)))","v":1925.6325000000002},{"$f":"IF($F$19=1,0,(VLOOKUP($I$21,Tablas!$A$755:$G$821,4,TRUE)))","v":1747.5150000000001},{"$f":"IF($F$19=1,0,(VLOOKUP($I$21,Tablas!$A$755:$G$821,5,TRUE)))","v":1233.2649999999999},{"$f":"IF($F$19=1,0,(VLOOKUP($I$21,Tablas!$A$755:$G$821,6,TRUE)))","v":892.45749999999998}]
[null,null,null,null,"Prima para hijo (s)",null,{"$f":"IF($F$21=0,0,(VLOOKUP($F$21,Tablas!$A$822:$G$824,3,TRUE)))","v":850.38250000000005},{"$f":"IF($F$21=0,0,(VLOOKUP($F$21,Tablas!$A$822:$G$824,4,TRUE)))","v":771.37500000000011},{"$f":"IF($F$21=0,0,(VLOOKUP($F$21,Tablas!$A$822:$G$824,5,TRUE)))","v":577.12875000000008},{"$f":"IF($F$21=0,0,(VLOOKUP($F$21,Tablas!$A$822:$G$824,6,TRUE)))","v":418.17874999999998}]
[null,null,null,null,"Total de Prima neta",null,{"$f":"SUM(G50:G52)","v":4180.1512499999999},{"$f":"SUM(H50:H52)","v":3793.2950000000001},{"$f":"SUM(I50:I52)","v":2729.7325000000001},{"$f":"SUM(J50:J52)","v":1976.1224999999999}]
[null,null,null,null,"Tarifa administrativa anual",null,75,75,75,75]
[null,null,null,null,"IVA (12%)",null,{"$f":"(G53+G54)*12%","v":510.61814999999996},{"$f":"(H53+H54)*12%","v":464.19540000000001},336.56790000000001,{"$f":"(J53+J54)*12%","v":246.13469999999998}]
[null,null,null,null,"TOTAL de primera cuota",null,{"$f":"SUM(G53:G55)","v":4765.7694000000001},{"$f":"SUM(H53:H55)","v":4332.4903999999997},{"$f":"SUM(I53:I55)","v":3141.3004000000001},{"$f":"SUM(J53:J55)","v":2297.2572}]
[null,null,null,null,"Costo de tarifa trimestral 2 a 4",null,{"$f":"G53+G55 - G54*12%","v":4681.7694000000001},{"$f":"H53+H55 - H54*12%","v":4248.4903999999997},3057.3004000000001,{"$f":"J53+J55 - J54*12%","v":2213.2572}]
[null,null,null,null,"TOTAL ANUAL",null,{"$f":"G56+(G57*3)","v":18811.077600000001},{"$f":"H56+(H57*3)","v":17077.961599999999},12313.2016,{"$f":"J56+(J57*3)","v":8937.0288}]
[]
[]
{"$rows_left_out":3}
{"sheet":"Resumen tarifas","index":2,"n_rows":60,"n_cols":8,"rows_kept":60,"cut":false,"hidden":false,"merged":[[57,0,57,7],[58,0,58,7],[59,0,61,7],[55,0,55,1],[50,0,50,1],[44,4,44,7],[46,4,46,7],[49,4,49,7],[49,0,49,1],[26,0,26,6],[28,2,28,6],[31,4,31,5],[34,4,34,5],[28,0,28,1],[31,0,31,1],[34,0,34,1],[44,0,44,1],[45,0,45,1],[46,0,46,1],[47,0,47,1],[41,0,41,1]]}
[]
[null,null,null,null," "," "]
[]
[]
[]
[]
[]
[]
[]
[null,null,null,null," "," "," "]
[]
[]
[]
[]
[]
[]
[]
[]
[]
[]
[]
[]
[]
[]
[]
[]
["Cotizador de Seguro Médico - Bupa Global Health Plans"]
[]
["Nombre del Asegurado Titular",null,{"$f":"+'INGRESO DE DATOS'!$D$15","v":"NOMBRE COMPLETO"}]
[]
[]
["Número de adultos en la póliza",null,{"$f":"+'INGRESO DE DATOS'!$D$17","v":2},null,"Edad del Asegurado Titular",null,{"$f":"+'INGRESO DE DATOS'!$D$19","v":32}]
[]
[]
["Número de niños en la póliza",null,{"$f":"+'INGRESO DE DATOS'!$H$17","v":2},null,"Edad del/la cónyuge ",null,{"$f":"+'INGRESO DE DATOS'!$H$19","v":46}]
[]
[]
[null,null,null,"FECHA DE LA COTIZACIÓN :",{"$f":"NOW()","v":"2021-12-20T11:33:26.690"}]
[]
[]
["Global Premier Health Plan"]
["Deducibles",null,null,null,"PLAN 1","PLAN 2","PLAN 3","PLAN 3"]
["En el país de residencia",null,null,null,250,2000,5000,10000]
["Fuera del país de residencia",null,null,null,5000,2000,5000,10000]
[null,null,null,null,"Tarifas anuales"]
[null,null,null,null,{"$f":"+'Global Premier'!G36","v":17108.615999999998},{"$f":"+'Global Premier'!H36","v":15533.055999999999},{"$f":"+'Global Premier'!I36","v":11201.455999999998},{"$f":"+'Global Premier'!J36","v":8132.2079999999996}]
[null,null,null,null,"Tarifas semi anuales"]
[null,null,null,null,{"$f":"+'Global Premier'!G45","v":9107.0464800000009},{"$f":"+'Global Premier'!H45","v":8271.9996800000008},{"$f":"+'Global Premier'!I45","v":5976.2516800000003},{"$f":"+'Global Premier'!J45","v":4349.5502400000005}]
[null,null,null,null,{"$f":"+'Global Premier'!G46","v":9023.0464800000009},{"$f":"+'Global Premier'!H46","v":8187.9996800000008},{"$f":"+'Global Premier'!I46","v":5892.2516800000003},{"$f":"+'Global Premier'!J46","v":4265.5502400000005}]
[null,null,null,null,"Tarifas trimestrales"]
[null,null,null,null,{"$f":"+'Global Premier'!G56","v":4765.7694000000001},{"$f":"+'Global Premier'!H56","v":4332.4903999999997},{"$f":"+'Global Premier'!I56","v":3141.3004000000001},{"$f":"+'Global Premier'!J56","v":2297.2572}]
[null,null,null,null,{"$f":"+'Global Premier'!G57","v":4681.7694000000001},{"$f":"+'Global Premier'!H57","v":4248.4903999999997},{"$f":"+'Global Premier'!I57","v":3057.3004000000001},{"$f":"+'Global Premier'!J57","v":2213.2572}]
[]
[]
["Una tarifa administrativa de US$75 se carga automáticamente al primer pago"]
["*Basado en un modo de pago anual"]
[]
[]
["Tarifas en US $ -   Efectivas a partir del 1ro de enero de  2021\t"]
["Este presupuesto solamente tiene carácter informativo y en ningún momento expresa compromiso legal para suministrarle cobertura de seguro. La emisión de una póliza de seguro Bupa está sujeta a todas las evaluaciones de riesgo por parte de Bupa y a la recepción de todos los pagos de prima requeridos."]
{"$rows_left_out":1}
{"sheet":"Tablas","index":3,"n_rows":1497,"n_cols":22,"rows_kept":1497,"cut":false,"hidden":true,"merged":[[1424,0,1424,6],[1425,0,1425,1],[1425,2,1425,6],[1348,0,1348,6],[1349,0,1349,6],[1350,0,1350,1],[1350,2,1350,6],[1423,0,1423,6],[1200,0,1200,1],[1200,2,1200,6],[1273,0,1273,6],[1274,0,1274,6],[1275,0,1275,1],[1275,2,1275,6],[1124,0,1124,6],[1125,0,1125,6],[1126,0,1126,1],[1126,2,1126,6],[1199,0,1199,6],[976,0,976,1],[976,2,976,6],[1049,0,1049,6],[1050,0,1050,6],[1051,0,1051,1],[1051,2,1051,6],[900,0,900,6],[901,0,901,6],[902,0,902,1],[902,2,902,6],[975,0,975,6],[1,0,1,6],[2,0,2,6],[77,0,77,1],[77,2,77,6],[76,0,76,6],[3,0,3,1],[3,2,3,6],[376,0,376,1],[376,2,376,6],[150,0,150,6],[151,0,151,6],[152,0,152,1],[152,2,152,6],[225,0,225,6],[226,0,226,1],[375,0,375,6],[226,2,226,6],[300,0,300,6],[301,0,301,6],[302,0,302,1],[302,2,302,6],[526,0,526,6],[450,0,450,6],[451,0,451,6],[452,0,452,1],[452,2,452,6],[525,0,525,6],[527,0,527,1],[527,2,527,6],[600,0,600,6],[601,0,601,6],[602,0,602,1],[602,2,602,6],[751,0,751,6],[675,0,675,6],[676,0,676,6],[677,0,677,1],[677,2,677,6],[750,0,750,6],[752,0,752,1],[752,2,752,6],[825,0,825,6],[826,0,826,6],[827,0,827,1],[827,2,827,6]]}
[]
["BUPA GLOBAL ELITE",null,null,null,null,null,null,null,"FACTOR MENSUAL:",null,{"$f":"1.12/12","v":9.3333333333333338E-2}]
["TARIFAS ANUALES",null,null,null,null,null,null,null,"FACTOR TRIMESTRAL:",null,{"$f":"1.1/4","v":0.27500000000000002}]
["EDAD",null,null,null,null,null,null,null,"FACTOR SEMIANUAL:",null,{"$f":"1.06/2","v":0.53}]
[" "," ",1000,2000,3500,5000,10000,null,null,null,null,null,1000,2000,3500,5000,10000,1000,2000,3500,5000,10000]
[18,"OK",{"$f":"M6*$K$6","v":5940.65},{"$f":"N6*$K$6","v":5206.25},4410.6499999999996,3823.2999999999997,2966.5,null,"Descuento (0%):",null,0.85,null,6989,6125,5189,4498,3490,{"$f":"M6*85%","v":5940.65},{"$f":"N6*85%","v":5206.25},{"$f":"O6*85%","v":4410.6499999999996},{"$f":"P6*85%","v":3823.2999999999997},{"$f":"Q6*85%","v":2966.5}]
[19,null,{"$f":"M7*$K$6","v":6012.05},{"$f":"N7*$K$6","v":5270},{"$f":"O7*$K$6","v":4457.3999999999996},{"$f":"P7*$K$6","v":3865.7999999999997},{"$f":"Q7*$K$6","v":2998.7999999999997},null,null,null,null,null,7073,6200,5244,4548,3528,{"$f":"M7*85%","v":6012.05},{"$f":"N7*85%","v":5270},{"$f":"O7*85%","v":4457.3999999999996},{"$f":"P7*85%","v":3865.7999999999997},{"$f":"Q7*85%","v":2998.7999999999997}]
[20,null,6088.55,5334.5999999999995,4506.7,3907.45,3030.25,null,null,null,null,null,7163,6276,5302,4597,3565,6088.55,5334.5999999999995,4506.7,3907.45,3030.25]
[21,null,6164.2,5403.45,4556.8499999999995,3951.65,3065.1,null,null,null,null,null,7252,6357,5361,4649,3606,6164.2,5403.45,4556.8499999999995,3951.65,3065.1]
[22,null,6244.0999999999995,5473.15,4610.3999999999996,3998.4,3100.7999999999997,null,null,null,null,null,7346,6439,5424,4704,3648,6244.0999999999995,5473.15,4610.3999999999996,3998.4,3100.7999999999997]
[23,null,6326.55,5547.0999999999995,4665.6499999999996,4045.15,3138.2,null,null,null,null,null,7443,6526,5489,4759,3692,6326.55,5547.0999999999995,4665.6499999999996,4045.15,3138.2]
[24,null,6411.55,5622.75,4721.75,4094.45,3175.6,null,null,null,null,null,7543,6615,5555,4817,3736,6411.55,5622.75,4721.75,4094.45,3175.6]
[25,null,6501.65,5698.4,4778.7,4143.75,3214.7,null,null,null,null,null,7649,6704,5622,4875,3782,6501.65,5698.4,4778.7,4143.75,3214.7]
[26,null,6629.15,5809.75,4865.3999999999996,4219.3999999999996,3272.5,null,null,null,null,null,7799,6835,5724,4964,3850,6629.15,5809.75,4865.3999999999996,4219.3999999999996,3272.5]
[27,null,6760.9,5927.05,4954.6499999999996,4296.75,3332,null,null,null,null,null,7954,6973,5829,5055,3920,6760.9,5927.05,4954.6499999999996,4296.75,3332]
[28,null,6899.45,6048.5999999999995,5047.3,4375.8,3394.9,null,null,null,null,null,8117,7116,5938,5148,3994,6899.45,6048.5999999999995,5047.3,4375.8,3394.9]
[29,null,7043.95,6174.4,5145.05,4460.8,3459.5,null,null,null,null,null,8287,7264,6053,5248,4070,7043.95,6174.4,5145.05,4460.8,3459.5]
[30,null,7191.8499999999995,6304.45,5247.05,4550.05,3528.35,null,null,null,null,null,8461,7417,6173,5353,4151,7191.8499999999995,6304.45,5247.05,4550.05,3528.35]
[31,null,7347.4,6442.15,5349.05,4639.3,3597.2,null,null,null,null,null,8644,7579,6293,5458,4232,7347.4,6442.15,5349.05,4639.3,3597.2]
[32,null,7505.5,6579,5460.4,4735.3499999999995,3672,null,null,null,null,null,8830,7740,6424,5571,4320,7505.5,6579,5460.4,4735.3499999999995,3672]
[33,null,7672.0999999999995,6725.2,5570.9,4832.25,3746.7999999999997,null,null,null,null,null,9026,7912,6554,5685,4408,7672.0999999999995,6725.2,5570.9,4832.25,3746.7999999999997]
[34,null,7842.0999999999995,6872.25,5688.2,4934.25,3825,null,null,null,null,null,9226,8085,6692,5805,4500,7842.0999999999995,6872.25,5688.2,4934.25,3825]
[35,null,8017.2,7026.95,5808.9,5037.0999999999995,3906.6,null,null,null,null,null,9432,8267,6834,5926,4596,8017.2,7026.95,5808.9,5037.0999999999995,3906.6]
[36,null,8197.4,7185.05,5931.3,5144.2,3988.2,null,null,null,null,null,9644,8453,6978,6052,4692,8197.4,7185.05,5931.3,5144.2,3988.2]
[37,null,8382.6999999999989,7348.25,6062.2,5256.4,4076.6,null,null,null,null,null,9862,8645,7132,6184,4796,8382.6999999999989,7348.25,6062.2,5256.4,4076.6]
[38,null,8574.7999999999993,7515.7,6193.95,5371.15,4164.1499999999996,null,null,null,null,null,10088,8842,7287,6319,4899,8574.7999999999993,7515.7,6193.95,5371.15,4164.1499999999996]
[39,null,8770.2999999999993,7687.4,6329.95,5488.45,4256.8,null,null,null,null,null,10318,9044,7447,6457,5008,8770.2999999999993,7687.4,6329.95,5488.45,4256.8]
[40,null,8970.9,7864.2,6467.65,5609.15,4350.3,null,null,null,null,null,10554,9252,7609,6599,5118,8970.9,7864.2,6467.65,5609.15,4350.3]
[41,null,9179.15,8046.0999999999995,6613,5733.25,4447.2,null,null,null,null,null,10799,9466,7780,6745,5232,9179.15,8046.0999999999995,6613,5733.25,4447.2]
[42,null,9392.5,8230.5499999999993,6760.9,5863.3,4546.6499999999996,null,null,null,null,null,11050,9683,7954,6898,5349,9392.5,8230.5499999999993,6760.9,5863.3,4546.6499999999996]
[43,null,9609.25,8421.7999999999993,6911.3499999999995,5993.3499999999995,4648.6499999999996,null,null,null,null,null,11305,9908,8131,7051,5469,9609.25,8421.7999999999993,6911.3499999999995,5993.3499999999995,4648.6499999999996]
[44,null,9831.1,8618.15,7066.9,6128.5,4753.2,null,null,null,null,null,11566,10139,8314,7210,5592,9831.1,8618.15,7066.9,6128.5,4753.2]
[45,null,10059.75,8818.75,7226.7,6267.05,4861.1499999999996,null,null,null,null,null,11835,10375,8502,7373,5719,10059.75,8818.75,7226.7,6267.05,4861.1499999999996]
[46,null,10292.65,9021.0499999999993,7389.9,6408.15,4969.95,null,null,null,null,null,12109,10613,8694,7539,5847,10292.65,9021.0499999999993,7389.9,6408.15,4969.95]
[47,null,10530.65,9231.85,7557.3499999999995,6552.65,5082.1499999999996,null,null,null,null,null,12389,10861,8891,7709,5979,10530.65,9231.85,7557.3499999999995,6552.65,5082.1499999999996]
[48,null,10776.3,9442.65,7728.2,6701.4,5196.8999999999996,null,null,null,null,null,12678,11109,9092,7884,6114,10776.3,9442.65,7728.2,6701.4,5196.8999999999996]
[49,null,11023.65,9662.7999999999993,7901.5999999999995,6851.8499999999995,5314.2,null,null,null,null,null,12969,11368,9296,8061,6252,11023.65,9662.7999999999993,7901.5999999999995,6851.8499999999995,5314.2]
[50,null,11278.65,9884.65,8081.8,7007.4,5434.05,null,null,null,null,null,13269,11629,9508,8244,6393,11278.65,9884.65,8081.8,7007.4,5434.05]
[51,null,11538.75,10113.299999999999,8265.4,7166.3499999999995,5557.3,null,null,null,null,null,13575,11898,9724,8431,6538,11538.75,10113.299999999999,8265.4,7166.3499999999995,5557.3]
[52,null,11801.4,10345.35,8449.85,7327,5682.25,null,null,null,null,null,13884,12171,9941,8620,6685,11801.4,10345.35,8449.85,7327,5682.25]
[53,null,12072.55,10582.5,8640.25,7492.75,5810.5999999999995,null,null,null,null,null,14203,12450,10165,8815,6836,12072.55,10582.5,8640.25,7492.75,5810.5999999999995]
[54,null,12348.8,10823.05,8835.75,7661.9,5941.5,null,null,null,null,null,14528,12733,10395,9014,6990,12348.8,10823.05,8835.75,7661.9,5941.5]
[55,null,12631,11069.55,9033.7999999999993,7832.75,6075.8,null,null,null,null,null,14860,13023,10628,9215,7148,12631,11069.55,9033.7999999999993,7832.75,6075.8]
[56,null,12914.9,11319.449999999999,9236.1,8008.7,6210.0999999999995,null,null,null,null,null,15194,13317,10866,9422,7306,12914.9,11319.449999999999,9236.1,8008.7,6210.0999999999995]
[57,null,13206.449999999999,11576.15,9440.1,8184.65,6348.65,null,null,null,null,null,15537,13619,11106,9629,7469,13206.449999999999,11576.15,9440.1,8184.65,6348.65]
[58,null,13503.949999999999,11837.1,9649.1999999999989,8366.5499999999993,6489.75,null,null,null,null,null,15887,13926,11352,9843,7635,13503.949999999999,11837.1,9649.1999999999989,8366.5499999999993,6489.75]
[59,null,13804.85,12099.75,9864.25,8553.5499999999993,6632.55,null,null,null,null,null,16241,14235,11605,10063,7803,13804.85,12099.75,9864.25,8553.5499999999993,6632.55]
[60,null,14111.699999999999,12370.05,10080.15,8740.5499999999993,6778.75,null,null,null,null,null,16602,14553,11859,10283,7975,14111.699999999999,12370.05,10080.15,8740.5499999999993,6778.75]
[61,null,15726.699999999999,13785.3,11229.35,9735.9,7551.4,null,null,null,null,null,18502,16218,13211,11454,8884,15726.699999999999,13785.3,11229.35,9735.9,7551.4]
[62,null,17472.599999999999,15315.3,12471.199999999999,10813.699999999999,8386.1,null,null,null,null,null,20556,18018,14672,12722,9866,17472.599999999999,15315.3,12471.199999999999,10813.699999999999,8386.1]
[63,null,19352.8,16962.599999999999,13812.5,11976.5,9288.7999999999993,null,null,null,null,null,22768,19956,16250,14090,10928,19352.8,16962.599999999999,13812.5,11976.5,9288.7999999999993]
[64,null,21360.5,18722.099999999999,15248.15,13221.75,10255.25,null,null,null,null,null,25130,22026,17939,15555,12065,21360.5,18722.099999999999,15248.15,13221.75,10255.25]
[65,null,23503.35,20600.599999999999,16783.25,14552.85,11286.3,null,null,null,null,null,27651,24236,19745,17121,13278,23503.35,20600.599999999999,16783.25,14552.85,11286.3]
[66,null,25777.1,22595.55,18416.099999999999,15968.1,12385.35,null,null,null,null,null,30326,26583,21666,18786,14571,25777.1,22595.55,18416.099999999999,15968.1,12385.35]
[67,null,28181.75,24702.7,20144.149999999998,17465.8,13546.449999999999,null,null,null,null,null,33155,29062,23699,20548,15937,28181.75,24702.7,20144.149999999998,17465.8,13546.449999999999]
[68,null,30717.3,26923.75,21970.799999999999,19051.05,14775.55,null,null,null,null,null,36138,31675,25848,22413,17383,30717.3,26923.75,21970.799999999999,19051.05,14775.55]
[69,null,33388,29264.649999999998,23894.35,20718.75,16067.55,null,null,null,null,null,39280,34429,28111,24375,18903,33388,29264.649999999998,23894.35,20718.75,16067.55]
[70,null,36187.049999999996,31718.6,25915.649999999998,22471.45,17428.399999999998,null,null,null,null,null,42573,37316,30489,26437,20504,36187.049999999996,31718.6,25915.649999999998,22471.45,17428.399999999998]
[71,null,39121.25,34289.85,28033,24306.6,18850.45,null,null,null,null,null,46025,40341,32980,28596,22177,39121.25,34289.85,28033,24306.6,18850.45]
[72,null,42184.65,36975,30248.1,26227.599999999999,20341.349999999999,null,null,null,null,null,49629,43500,35586,30856,23931,42184.65,36975,30248.1,26227.599999999999,20341.349999999999]
{"$rows_left_out":1437}