{"text_format":"1","workbook":"xlsx","n_sheets":8,"sheets":["INGRESO DE DATOS","Global Ultimate","Global Elite","Global Premier","Global Select","Global Major Medical","Resumen tarifas","Tablas"],"not_rendered":{"charts":0,"images":7,"macros":1,"external_links":0,"defined_names":7,"comments":1,"pivot_tables":0},"unopened":[],"bounds":{"document_bytes":16777216,"sheet_cells":100000,"rows_first":2000,"rows_last":500,"rows_between":2000,"halvings":0,"cell_chars":16384,"cell_head_chars":4096},"cells_cut":0,"cells_raw":0,"read":"whole","date_system":"1900"}

{"sheet":"INGRESO DE DATOS","index":0,"n_rows":25,"n_cols":11,"rows_kept":25,"cut":false,"hidden":false,"merged":[[22,3,22,4],[22,8,22,9],[16,5,16,8],[12,1,12,2],[14,1,14,2],[12,3,12,9],[14,5,14,8],[16,1,16,2]]}
[]
[null,null,null,null,null,null,null,null,null," "," "]
[]
[]
[]
[]
[]
[]
[]
[]
[]
[]
[null,"Nombre del Asegurado Titular",null,"NOMBRE COMPLETO"]
[]
[null,"Número de adultos en la póliza",null,2,null,"Número de niños en la póliza",null,null,null,3]
[]
[null,"Edad del Asegurado Titular",null,65,null,"Edad del/la cónyuge ",null,null,null,71]
[]
[]
[null,null,null,null,null,null,"Variante con coaseguro fuera del país de residencia",false,null,false]
[]
[]
[]
[]
[null,2,null,2]

{"sheet":"Global Ultimate","index":1,"n_rows":73,"n_cols":10,"rows_kept":73,"cut":false,"hidden":false,"merged":[[37,0,38,0],[37,1,38,1],[45,4,45,5],[51,4,51,5],[13,0,13,1],[13,5,13,7],[25,4,25,7],[35,4,35,7],[47,4,47,7],[69,4,69,5],[72,4,74,7],[71,4,71,7],[57,4,57,5],[33,4,33,5],[52,4,52,5],[70,4,70,7],[63,4,63,5],[64,4,64,5],[59,4,59,7]]}
[]
[]
[null,null,null,null,null,null,null," "," "," "]
[]
[]
[]
[null,null,null,null,null,null,null," "," "," "]
[]
[]
[]
[]
[]
[]
["GLOBAL ULTIMATE HEALTH PLAN",null,null,null,"Nombre del Asegurado Titular",{"$f":"+'INGRESO DE DATOS'!$D$13","v":"NOMBRE COMPLETO"}]
[]
[null,null,null,null,"Número de adultos en la póliza",{"$f":"+'INGRESO DE DATOS'!$D$15","v":2},"Edad del Asegurado Titular",{"$f":"+'INGRESO DE DATOS'!$D$17","v":65}]
[]
[null,null,null,null,"Número de niños en la póliza",{"$f":"+'INGRESO DE DATOS'!$J$15","v":3},"Edad del/la conyuge",{"$f":"+'INGRESO DE DATOS'!$J$17","v":71}]
[null,null,null,null,null,null,null," "," "]
[null,null,null,null,"Número de niños menores de 16 años",{"$f":"+'INGRESO DE DATOS'!$B$25","v":2},"Fecha de la cotización:",{"$f":"NOW()","v":"2021-11-08T17:34:27.120"}]
[null,null,null,null,null,null," ",false,null," "]
[null,null,null,null,"Deducibles",null,"PLAN 1","PLAN 2"]
[null,null,null,null,"En el país de residencia",null,0,1000]
[null,null,null,null,"Fuera del país de residencia",null,0,1000]
[]
[null,null,null,null,"Tarifas anuales"]
[null,null,null,null,"Prima para Asegurado Titular",null,{"$f":"(VLOOKUP($H$16,Tablas!$A$905:$G$971,3,TRUE))","v":64879},{"$f":"(VLOOKUP($H$16,Tablas!$A$905:$G$971,4,TRUE))","v":41859}]
[null,null,null,null,"Prima para conyuge",null,{"$f":"(IF($F$16=1,0,(VLOOKUP($H$18,Tablas!$A$905:$G$971,3,TRUE))))","v":107089},{"$f":"(IF($F$16=1,0,(VLOOKUP($H$18,Tablas!$A$905:$G$971,4,TRUE))))","v":69089}]
[null,null,null,null,"Prima para hijo (s)",null,{"$f":"(IF($F$16=1,\n(IF($F$18=0, 0,\n (IF($F$20>$F$18, (VLOOKUP($F$18,Tablas!$A$972:$G$974,3,TRUE)),\n(IF($F$18>4,(IF($F$20=0, (VLOOKUP(3,Tablas!$A$972:$G$974,3,TRUE)),\n(IF($F$20=1, (VLOOKUP(3,Tablas!$A$972:$G$974,3,TRUE)),\n(IF($F$20=2, (VLOOKUP(3,Tablas!$A$972:$G$974,3,TRUE)),\n(VLOOKUP(3,Tablas!$A$972:$G$974,3,TRUE)))))))),\n(IF($F$18=4,(IF(4-$F$20=0,(VLOOKUP(2,Tablas!$A$972:$G$974,3,TRUE)),\n(IF(4-$F$20=1,(VLOOKUP(2,Tablas!$A$972:$G$974,3,TRUE)),\n(IF(4-$F$20=2, (VLOOKUP(2,Tablas!$A$972:$G$974,3,TRUE)),\n(VLOOKUP(3,Tablas!$A$972:$G$974,3,TRUE)))))))),\n(IF($F$18=3,(IF(3-$F$20=0,(VLOOKUP(1,Tablas!$A$972:$G$974,3,TRUE)),\n(IF(3-$F$20=1,(VLOOKUP(1,Tablas!$A$972:$G$974,3,TRUE)),\n(IF(3-$F$20=2, (VLOOKUP(2,Tablas!$A$972:$G$974,3,TRUE)),\n(VLOOKUP(3,Tablas!$A$972:$G$974,3,TRUE)))))))),\n\n(IF($F$18=2,(IF(2-$F$20=0, 0,\n(IF(2-$F$20=1,(VLOOKUP(1,Tablas!$A$972:$G$974,3,TRUE)),\n(IF(2-$F$20=2, (VLOOKUP(2,Tablas!$A$972:$G$974,3,TRUE)),\n         0)))))),\n(IF($F$18=1,(IF(1-$F$20=0, 0,\n(IF(1-$F$20=1,(VLOOKUP(1,Tablas!$A$972:$G$974,3,TRUE)),0)))),0)))))))))))))),\n(IF($F$18=0, 0,\n (IF($F$20>$F$18, (VLOOKUP($F$18,Tablas!$A$972:$G$974,3,TRUE)),\n(IF($F$18=4,(IF(4-$F$20=0, 0,\n(IF(4-$F$20=1, (VLOOKUP(1,Tablas!$A$972:$G$974,3,TRUE)),\n(IF(4-$F$20=2, (VLOOKUP(2,Tablas!$A$972:$G$974,3,TRUE)),\n(IF(4-$F$20=3, (VLOOKUP(3,Tablas!$A$972:$G$974,3,TRUE)),\n(IF(4-$F$20=4, (VLOOKUP(3,Tablas!$A$972:$G$974,3,TRUE)),\n0)))))))))),\n(IF($F$18=5,(IF(5-$F$20=0, (VLOOKUP(1,Tablas!$A$972:$G$974,3,TRUE)),\n(IF(5-$F$20=1, (VLOOKUP(1,Tablas!$A$972:$G$974,3,TRUE)),\n(IF(5-$F$20=2, (VLOOKUP(2,Tablas!$A$972:$G$974,3,TRUE)),\n(IF(5-$F$20=3, (VLOOKUP(3,Tablas!$A$972:$G$974,3,TRUE)),\n(IF(5-$F$20=4, (VLOOKUP(3,Tablas!$A$972:$G$974,3,TRUE)),\n(VLOOKUP(3,Tablas!$A$972:$G$974,3,TRUE)))))))))))),\n(IF($F$18=6,(IF(6-$F$20=0, (VLOOKUP(2,Tablas!$A$972:$G$974,3,TRUE)),\n(IF(6-$F$20=1, (VLOOKUP(2,Tablas!$A$972:$G$974,3,TRUE)),\n(IF(6-$F$20=2, (VLOOKUP(2,Tablas!$A$972:$G$974,3,TRUE)),\n(IF(6-$F$20=3, (VLOOKUP(3,Tablas!$A$972:$G$974,3,TRUE)),\n(IF(6-$F$20=4, (VLOOKUP(3,Tablas!$A$972:$G$974,3,TRUE)),\n(VLOOKUP(3,Tablas!$A$972:$G$974,3,TRUE)))))))))))),\n(IF($F$18>6,(IF(7-$F$20=0, (VLOOKUP(3,Tablas!$A$972:$G$974,3,TRUE)),\n(IF(7-$F$20=1, (VLOOKUP(3,Tablas!$A$972:$G$974,3,TRUE)),\n(IF(7-$F$20=2, (VLOOKUP(3,Tablas!$A$972:$G$974,3,TRUE)),\n(IF(7-$F$20=3, (VLOOKUP(3,Tablas!$A$972:$G$974,3,TRUE)),\n(IF(7-$F$20=4, (VLOOKUP(3,Tablas!$A$972:$G$974,3,TRUE)),\n(VLOOKUP(3,Tablas!$A$972:$G$974,3,TRUE)))))))))))),\n\n(IF($F$18=3,(IF(3-$F$20=0,0,\n(IF(3-$F$20=1,(VLOOKUP(1,Tablas!$A$972:$G$974,3,TRUE)),\n(IF(3-$F$20=2, (VLOOKUP(2,Tablas!$A$972:$G$974,3,TRUE)),\n(VLOOKUP(3,Tablas!$A$972:$G$974,3,TRUE)))))))),\n\n(IF($F$18=2,(IF(2-$F$20=0, 0,\n(IF(2-$F$20=1,(VLOOKUP(1,Tablas!$A$972:$G$974,3,TRUE)),\n(IF(2-$F$20=2, (VLOOKUP(2,Tablas!$A$972:$G$974,3,TRUE)),\n         0)))))),\n(IF($F$18=1,(IF(1-$F$20=0, 0,\n(IF(1-$F$20=1,(VLOOKUP(1,Tablas!$A$972:$G$974,3,TRUE)),0)))),0))))))))))))))))))))","v":7354},{"$f":"(IF($F$16=1,\n(IF($F$18=0, 0,\n (IF($F$20>$F$18, (VLOOKUP($F$18,Tablas!$A$972:$G$974,4,TRUE)),\n(IF($F$18>4,(IF($F$20=0, (VLOOKUP(3,Tablas!$A$972:$G$974,4,TRUE)),\n(IF($F$20=1, (VLOOKUP(3,Tablas!$A$972:$G$974,4,TRUE)),\n(IF($F$20=2, (VLOOKUP(3,Tablas!$A$972:$G$974,4,TRUE)),\n(VLOOKUP(3,Tablas!$A$972:$G$974,4,TRUE)))))))),\n(IF($F$18=4,(IF(4-$F$20=0,(VLOOKUP(2,Tablas!$A$972:$G$974,4,TRUE)),\n(IF(4-$F$20=1,(VLOOKUP(2,Tablas!$A$972:$G$974,4,TRUE)),\n(IF(4-$F$20=2, (VLOOKUP(2,Tablas!$A$972:$G$974,4,TRUE)),\n(VLOOKUP(3,Tablas!$A$972:$G$974,4,TRUE)))))))),\n(IF($F$18=3,(IF(3-$F$20=0,(VLOOKUP(1,Tablas!$A$972:$G$974,4,TRUE)),\n(IF(3-$F$20=1,(VLOOKUP(1,Tablas!$A$972:$G$974,4,TRUE)),\n(IF(3-$F$20=2, (VLOOKUP(2,Tablas!$A$972:$G$974,4,TRUE)),\n(VLOOKUP(3,Tablas!$A$972:$G$974,4,TRUE)))))))),\n\n(IF($F$18=2,(IF(2-$F$20=0, 0,\n(IF(2-$F$20=1,(VLOOKUP(1,Tablas!$A$972:$G$974,4,TRUE)),\n(IF(2-$F$20=2, (VLOOKUP(2,Tablas!$A$972:$G$974,4,TRUE)),\n         0)))))),\n(IF($F$18=1,(IF(1-$F$20=0, 0,\n(IF(1-$F$20=1,(VLOOKUP(1,Tablas!$A$972:$G$974,4,TRUE)),0)))),0)))))))))))))),\n(IF($F$18=0, 0,\n (IF($F$20>$F$18, (VLOOKUP($F$18,Tablas!$A$972:$G$974,4,TRUE)),\n(IF($F$18=4,(IF(4-$F$20=0, 0,\n(IF(4-$F$20=1, (VLOOKUP(1,Tablas!$A$972:$G$974,4,TRUE)),\n(IF(4-$F$20=2, (VLOOKUP(2,Tablas!$A$972:$G$974,4,TRUE)),\n(IF(4-$F$20=3, (VLOOKUP(3,Tablas!$A$972:$G$974,4,TRUE)),\n(IF(4-$F$20=4, (VLOOKUP(3,Tablas!$A$972:$G$974,4,TRUE)),\n0)))))))))),\n(IF($F$18=5,(IF(5-$F$20=0, (VLOOKUP(1,Tablas!$A$972:$G$974,4,TRUE)),\n(IF(5-$F$20=1, (VLOOKUP(1,Tablas!$A$972:$G$974,4,TRUE)),\n(IF(5-$F$20=2, (VLOOKUP(2,Tablas!$A$972:$G$974,4,TRUE)),\n(IF(5-$F$20=3, (VLOOKUP(3,Tablas!$A$972:$G$974,4,TRUE)),\n(IF(5-$F$20=4, (VLOOKUP(3,Tablas!$A$972:$G$974,4,TRUE)),\n(VLOOKUP(3,Tablas!$A$972:$G$974,4,TRUE)))))))))))),\n(IF($F$18=6,(IF(6-$F$20=0, (VLOOKUP(2,Tablas!$A$972:$G$974,4,TRUE)),\n(IF(6-$F$20=1, (VLOOKUP(2,Tablas!$A$972:$G$974,4,TRUE)),\n(IF(6-$F$20=2, (VLOOKUP(2,Tablas!$A$972:$G$974,4,TRUE)),\n(IF(6-$F$20=3, (VLOOKUP(3,Tablas!$A$972:$G$974,4,TRUE)),\n(IF(6-$F$20=4, (VLOOKUP(3,Tablas!$A$972:$G$974,4,TRUE)),\n(VLOOKUP(3,Tablas!$A$972:$G$974,4,TRUE)))))))))))),\n(IF($F$18>6,(IF(7-$F$20=0, (VLOOKUP(3,Tablas!$A$972:$G$974,4,TRUE)),\n(IF(7-$F$20=1, (VLOOKUP(3,Tablas!$A$972:$G$974,4,TRUE)),\n(IF(7-$F$20=2, (VLOOKUP(3,Tablas!$A$972:$G$974,4,TRUE)),\n(IF(7-$F$20=3, (VLOOKUP(3,Tablas!$A$972:$G$974,4,TRUE)),\n(IF(7-$F$20=4, (VLOOKUP(3,Tablas!$A$972:$G$974,4,TRUE)),\n(VLOOKUP(3,Tablas!$A$972:$G$974,4,TRUE)))))))))))),\n\n(IF($F$18=3,(IF(3-$F$20=0,0,\n(IF(3-$F$20=1,(VLOOKUP(1,Tablas!$A$972:$G$974,4,TRUE)),\n(IF(3-$F$20=2, (VLOOKUP(2,Tablas!$A$972:$G$974,4,TRUE)),\n(VLOOKUP(3,Tablas!$A$972:$G$974,4,TRUE)))))))),\n\n(IF($F$18=2,(IF(2-$F$20=0, 0,\n(IF(2-$F$20=1,(VLOOKUP(1,Tablas!$A$972:$G$974,4,TRUE)),\n(IF(2-$F$20=2, (VLOOKUP(2,Tablas!$A$972:$G$974,4,TRUE)),\n         0)))))),\n(IF($F$18=1,(IF(1-$F$20=0, 0,\n(IF(1-$F$20=1,(VLOOKUP(1,Tablas!$A$972:$G$974,4,TRUE)),0)))),0))))))))))))))))))))","v":4744}]
[null,null,null,null,"Total de Prima neta",null,{"$f":"SUM(G27:G29)","v":179322},{"$f":"SUM(H27:H29)","v":115692}]
{"$rows_left_out":44}
{"sheet":"Global Elite","index":2,"n_rows":79,"n_cols":11,"rows_kept":79,"cut":false,"hidden":false,"merged":[[51,4,51,10],[64,4,64,10],[78,4,79,10],[76,4,76,10],[36,4,36,5],[49,4,49,5],[62,4,62,5],[55,4,55,5],[57,4,57,5],[77,4,77,10],[43,4,43,5],[56,4,56,5],[68,4,68,5],[69,4,69,5],[70,4,70,5],[75,4,75,5],[38,4,38,10],[44,1,45,1],[44,0,45,0],[19,3,19,4],[15,3,15,4],[17,3,17,4],[15,0,15,1],[15,5,15,10],[23,4,23,5],[21,3,22,4],[32,4,32,5],[27,4,27,10]]}
[]
[]
[null,null,null,null,null,null,null," "," "," "]
[]
[]
[]
[null,null,null,null,null,null,null," "," "," "]
[]
[]
[]
[]
[]
[]
[]
[]
["GLOBAL ELITE HEALTH PLAN",null,null,"Nombre del Asegurado Titular",null,{"$f":"+'INGRESO DE DATOS'!$D$13","v":"NOMBRE COMPLETO"}]
[]
[null,null,null,"Número de adultos en la póliza",null,{"$f":"+'INGRESO DE DATOS'!$D$15","v":2},null,null,"Edad del Asegurado Titular",{"$f":"+'INGRESO DE DATOS'!$D$17","v":65}]
[]
[null,null,null,"Número de niños en la póliza",null,{"$f":"+'INGRESO DE DATOS'!$J$15","v":3},null,null,"Edad del/la conyuge",{"$f":"+'INGRESO DE DATOS'!$J$17","v":71}]
[null,null,null,null,null,null,null," "," "]
[null,null,null,"Número de niños menores de 10 años",null,{"$f":"+'INGRESO DE DATOS'!$D$25","v":2},null,null,"Fecha de la cotización:",{"$f":"NOW()","v":"2021-11-08T17:34:27.120"}]
[null,null,null,null,null,null," ",false,null," "]
[null,null,null,null,"DEDUCTIBLES",null,"PLAN 1","PLAN 2","PLAN 3","PLAN 4","PLAN 5"]
[null,null,null,null,"En el país de residencia",null,250,2000,3500,5000,10000]
[null,null,null,null,"Fuera del país de residencia",null,5000,2000,3500,5000,10000]
[]
[null,null,null,null,"Tarifas anuales"]
[null,null,null,null,"Prima para Asegurado Titular",null,{"$f":"(VLOOKUP($J$18,Tablas!$A$6:$G$72,3,TRUE))","v":27811},{"$f":"(VLOOKUP($J$18,Tablas!$A$6:$G$72,4,TRUE))","v":24376},{"$f":"(VLOOKUP($J$18,Tablas!$A$6:$G$72,5,TRUE))","v":19858},{"$f":"(VLOOKUP($J$18,Tablas!$A$6:$G$72,6,TRUE))","v":17219},{"$f":"(VLOOKUP($J$18,Tablas!$A$6:$G$72,7,TRUE))","v":13355}]
[null,null,null,null,"Prima para conyuge",null,{"$f":"(IF($F$18=1,0,(VLOOKUP($J$20,Tablas!$A$6:$G$72,3,TRUE))))","v":46292},{"$f":"(IF($F$18=1,0,(VLOOKUP($J$20,Tablas!$A$6:$G$72,3,TRUE))))","v":46292},{"$f":"(IF($F$18=1,0,(VLOOKUP($J$20,Tablas!$A$6:$G$72,3,TRUE))))","v":46292},{"$f":"(IF($F$18=1,0,(VLOOKUP($J$20,Tablas!$A$6:$G$72,3,TRUE))))","v":46292},{"$f":"(IF($F$18=1,0,(VLOOKUP($J$20,Tablas!$A$6:$G$72,3,TRUE))))","v":46292}]
{"$rows_left_out":50}
{"sheet":"Global Premier","index":3,"n_rows":74,"n_cols":10,"rows_kept":74,"cut":false,"hidden":false,"merged":[[72,4,72,9],[71,4,71,9],[73,4,74,9],[46,4,46,5],[41,4,41,5],[53,4,53,5],[64,4,64,5],[65,4,65,5],[66,4,66,5],[60,4,60,9],[43,1,44,1],[43,0,44,0],[14,0,14,1],[52,4,52,5],[54,4,54,5],[31,4,31,5],[14,5,14,9],[14,3,14,4],[16,3,16,4],[18,3,18,4],[36,4,36,9],[26,4,26,9],[48,4,48,9]]}
[]
[]
[null,null,null,null,null,null,null," "," "," "]
[]
[]
[]
[]
[]
[]
[]
[]
[]
[]
[]
["GLOBAL PREMIER HEALTH PLAN",null,null,"Nombre del Asegurado Titular",null,{"$f":"+'INGRESO DE DATOS'!$D$13","v":"NOMBRE COMPLETO"}]
[]
[null,null,null,"Número de adultos en la póliza",null,{"$f":"+'INGRESO DE DATOS'!$D$15","v":2},null,"Edad del Asegurado Titular",{"$f":"+'INGRESO DE DATOS'!$D$17","v":65}]
[]
[null,null,null,"Número de niños en la póliza",null,{"$f":"+'INGRESO DE DATOS'!$J$15","v":3},null,"Edad del/la conyuge",{"$f":"+'INGRESO DE DATOS'!$J$17","v":71}]
[null,null,null,null,null,null,null," "," "]
[null,null,null,null,null,null,null,"Fecha de la cotización:",{"$f":"NOW()","v":"2021-11-08T17:34:27.120"}]
[null,null,null,null,null,null," ",false,null," "]
[null,null,null,null,"Deducibles",null,"PLAN 1","PLAN 2","PLAN 3","PLAN 4"]
[null,null,null,null,"En el país de residencia",null,250,2000,5000,10000]
[null,null,null,null,"Fuera del país de residencia",null,5000,2000,5000,10000]
[]
[null,null,null,null,"Tarifas anuales"]
[null,null,null,null,"Prima para Asegurado Titular",null,{"$f":"(VLOOKUP($I$17,Tablas!$A$155:$G$221,3,TRUE))","v":14541.6},{"$f":"(VLOOKUP($I$17,Tablas!$A$155:$G$221,4,TRUE))","v":13195.2},{"$f":"(VLOOKUP($I$17,Tablas!$A$155:$G$221,5,TRUE))","v":9474.4},{"$f":"(VLOOKUP($I$17,Tablas!$A$155:$G$221,6,TRUE))","v":7048}]
[null,null,null,null,"Prima para conyuge",null,{"$f":"(IF($F$17=1,0,(VLOOKUP($I$19,Tablas!$A$155:$G$221,3,TRUE))))","v":24204.800000000003},{"$f":"(IF($F$17=1,0,(VLOOKUP($I$19,Tablas!$A$155:$G$221,4,TRUE))))","v":21968},{"$f":"(IF($F$17=1,0,(VLOOKUP($I$19,Tablas!$A$155:$G$221,5,TRUE))))","v":15864},{"$f":"(IF($F$17=1,0,(VLOOKUP($I$19,Tablas!$A$155:$G$221,6,TRUE))))","v":11800.800000000001}]
[null,null,null,null,"Prima para hijo (s)",null,{"$f":"(IF($F$19=0,0,(VLOOKUP($F$19,Tablas!$A$222:$G$224,3,TRUE))))","v":3969.6000000000004},{"$f":"(IF($F$19=0,0,(VLOOKUP($F$19,Tablas!$A$222:$G$224,4,TRUE))))","v":3603.2000000000003},{"$f":"(IF($F$19=0,0,(VLOOKUP($F$19,Tablas!$A$222:$G$224,5,TRUE))))","v":2766.4},{"$f":"(IF($F$19=0,0,(VLOOKUP($F$19,Tablas!$A$222:$G$224,6,TRUE))))","v":2058.4}]
{"$rows_left_out":45}
{"sheet":"Global Select","index":4,"n_rows":73,"n_cols":10,"rows_kept":73,"cut":false,"hidden":false,"merged":[[72,4,73,9],[71,4,71,9],[70,4,70,9],[30,4,30,5],[40,4,40,5],[52,4,52,5],[45,4,45,5],[57,4,57,5],[33,4,33,5],[63,4,63,5],[64,4,64,5],[65,4,65,5],[69,4,69,5],[59,4,59,9],[13,0,13,1],[42,0,43,0],[18,3,18,4],[51,4,51,5],[53,4,53,5],[42,1,43,1],[13,5,13,9],[25,4,25,9],[35,4,35,9],[47,4,47,9],[13,3,13,4],[15,3,15,4]]}
[]
[]
[null,null,null,null,null,null,null," "," "," "]
[]
[]
[]
[null,null,null,null,null,null,null," "," "," "]
[]
[]
[]
[]
[]
[]
["GLOBAL SELECT HEALTH PLAN",null,null,"Nombre del Asegurado Titular",null,{"$f":"+'INGRESO DE DATOS'!$D$13","v":"NOMBRE COMPLETO"}]
[]
[null,null,null,"Número de adultos en la póliza",null,{"$f":"+'INGRESO DE DATOS'!$D$15","v":2},null,"Edad del Asegurado Titular",{"$f":"+'INGRESO DE DATOS'!$D$17","v":65}]
[]
[null,null,null,null,null,null,null,"Edad del/la conyuge",{"$f":"+'INGRESO DE DATOS'!$J$17","v":71}]
[null,null,null,"Número de niños en la póliza",null,{"$f":"+'INGRESO DE DATOS'!$J$15","v":3},null," "," "]
[null,null,null,null,null,null,null,"Fecha de la cotización:",{"$f":"NOW()","v":"2021-11-08T17:34:27.120"}]
[null,null,null,null,null,null," ",false,null," "]
[null,null,null,null,"Deducibles",null,"PLAN 1","PLAN 2","PLAN 3","PLAN 4"]
[null,null,null,null,"En el país de residencia",null,250,2000,5000,10000]
[null,null,null,null,"Fuera del país de residencia",null,5000,2000,5000,10000]
[]
[null,null,null,null,"Tarifas anuales"]
[null,null,null,null,"Prima para Asegurado Titular",null,{"$f":"(VLOOKUP($I$16,Tablas!$A$305:$G$371,3,TRUE))","v":11099.2},{"$f":"(VLOOKUP($I$16,Tablas!$A$305:$G$371,4,TRUE))","v":10648},{"$f":"(VLOOKUP($I$16,Tablas!$A$305:$G$371,5,TRUE))","v":7663.2000000000007},{"$f":"(VLOOKUP($I$16,Tablas!$A$305:$G$371,6,TRUE))","v":5701.6}]
[null,null,null,null,"Prima para conyuge",null,{"$f":"(IF($F$16=1,0,(VLOOKUP($I$18,Tablas!$A$305:$G$371,3,TRUE))))","v":18803.2},{"$f":"(IF($F$16=1,0,(VLOOKUP($I$18,Tablas!$A$305:$G$371,4,TRUE))))","v":18042.400000000001},{"$f":"(IF($F$16=1,0,(VLOOKUP($I$18,Tablas!$A$305:$G$371,5,TRUE))))","v":13063.2},{"$f":"(IF($F$16=1,0,(VLOOKUP($I$18,Tablas!$A$305:$G$371,6,TRUE))))","v":9716}]
[null,null,null,null,"Prima para hijo (s)",null,{"$f":"(IF($F$19=0,0,(VLOOKUP($F$19,Tablas!$A$372:$G$374,3,TRUE))))","v":2988.8},{"$f":"(IF($F$19=0,0,(VLOOKUP($F$19,Tablas!$A$372:$G$374,4,TRUE))))","v":2869.6000000000004},{"$f":"(IF($F$19=0,0,(VLOOKUP($F$19,Tablas!$A$372:$G$374,5,TRUE))))","v":2216.8000000000002},{"$f":"(IF($F$19=0,0,(VLOOKUP($F$19,Tablas!$A$372:$G$374,6,TRUE))))","v":1648.8000000000002}]
[null,null,null,null,"Total de Prima neta",null,{"$f":"SUM(G27:G29)","v":32891.200000000004},{"$f":"SUM(H27:H29)","v":31560},{"$f":"SUM(I27:I29)","v":22943.200000000001},{"$f":"SUM(J27:J29)","v":17066.400000000001}]
{"$rows_left_out":44}
{"sheet":"Global Major Medical","index":5,"n_rows":70,"n_cols":10,"rows_kept":70,"cut":false,"hidden":false,"merged":[[18,3,18,4],[14,3,14,4],[14,5,14,8],[16,3,16,4],[14,0,14,1],[69,4,71,8],[68,4,68,8],[41,0,42,0],[41,1,42,1],[50,4,50,5],[51,4,51,5],[67,4,67,7],[61,4,61,5],[62,4,62,5]]}
[]
[]
[null,null,null,null,null,null,null," "," "," "]
[]
[]
[]
[null,null,null,null,null,null,null," "," "," "]
[]
[]
[]
[]
[]
[]
[]
["GLOBAL MAJOR MEDICAL HEALTH PLAN",null,null,"Nombre del Asegurado Titular",null,{"$f":"+'INGRESO DE DATOS'!$D$13","v":"NOMBRE COMPLETO"}]
[]
[null,null,null,"Número de adultos en la póliza",null,{"$f":"+'INGRESO DE DATOS'!$D$15","v":2},null,"Edad del Asegurado Titular",{"$f":"+'INGRESO DE DATOS'!$D$17","v":65}]
[]
[null,null,null,"Número de niños en la póliza",null,{"$f":"+'INGRESO DE DATOS'!$J$15","v":3},null,"Edad del/la conyuge",{"$f":"+'INGRESO DE DATOS'!$J$17","v":71}]
[null,null,null,null,null,null,null," "," "]
[null,null,null,null,null,null,null,"Fecha de la cotización:",{"$f":"NOW()","v":"2021-11-08T17:34:27.120"}]
[null,null,null,null,null,null," ",false,null," "]
[null,null,null,null,"Deducibles",null,"PLAN 1","PLAN 2","PLAN 3"]
[null,null,null,null,"En el país de residencia",null,7500,10000,20000]
[null,null,null,null,"Fuera del país de residencia",null,10000,20000,20000]
[]
[null,null,null,null,"Tarifas anuales"]
[null,null,null,null,"Prima para Asegurado Titular",null,{"$f":"(VLOOKUP($I$17,Tablas!$A$1129:$G$1195,3,TRUE))","v":8611},{"$f":"(VLOOKUP($I$17,Tablas!$A$1129:$G$1195,4,TRUE))","v":7582},{"$f":"(VLOOKUP($I$17,Tablas!$A$1129:$G$1195,5,TRUE))","v":5962}]
[null,null,null,null,"Prima para conyuge",null,{"$f":"(IF($F$17=1,0,(VLOOKUP($I$19,Tablas!$A$1129:$G$1195,3,TRUE))))","v":14367},{"$f":"(IF($F$17=1,0,(VLOOKUP($I$19,Tablas!$A$1129:$G$1195,4,TRUE))))","v":12585},{"$f":"(IF($F$17=1,0,(VLOOKUP($I$19,Tablas!$A$1129:$G$1195,5,TRUE))))","v":10151}]
[null,null,null,null,"Prima para hijo (s)",null,{"$f":"(IF($F$19=0,0,(VLOOKUP($F$19,Tablas!$A$1196:$G$1198,3,TRUE))))","v":2444},{"$f":"(IF($F$19=0,0,(VLOOKUP($F$19,Tablas!$A$1196:$G$1198,4,TRUE))))","v":2057},{"$f":"(IF($F$19=0,0,(VLOOKUP($F$19,Tablas!$A$1196:$G$1198,5,TRUE))))","v":1614}]
{"$rows_left_out":41}
{"sheet":"Resumen tarifas","index":6,"n_rows":131,"n_cols":8,"rows_kept":131,"cut":false,"hidden":false,"merged":[[61,0,61,1],[49,0,49,1],[28,0,28,1],[31,0,31,1],[34,0,34,1],[58,0,58,1],[62,0,62,1],[100,4,100,7],[26,0,26,6],[57,0,57,1],[28,2,28,6],[31,4,31,5],[34,4,34,5],[39,0,39,1],[40,0,40,1],[43,0,43,1],[44,0,44,1],[45,0,45,1],[46,0,46,1],[48,0,48,1],[51,0,51,1],[43,2,43,3],[45,2,45,3],[48,2,48,3],[117,2,117,3],[117,0,117,1],[95,0,95,1],[63,0,63,1],[85,0,85,1],[79,0,79,1],[80,0,80,1],[81,0,81,1],[82,0,82,1],[64,0,64,1],[66,0,66,1],[67,0,67,1],[76,0,76,1],[96,0,96,1],[97,0,97,1],[108,0,108,2],[112,2,112,3],[101,0,101,1],[98,0,98,1],[100,0,100,1],[128,0,128,7],[129,0,129,7],[130,0,132,7],[109,0,109,1],[112,0,112,1],[115,0,115,1],[126,0,126,1],[114,2,114,3],[118,0,118,1],[114,0,114,1],[113,0,113,1],[52,2,52,3],[70,3,70,7],[87,4,87,7],[103,4,103,7],[120,2,120,3],[97,4,97,7],[61,3,61,7],[63,3,63,7],[66,3,66,7],[79,4,79,7],[81,4,81,7],[84,4,84,7],[95,4,95,7],[69,0,69,2],[84,0,84,1],[92,0,92,1]]}
[]
[null,null,null,null," "," "]
[]
[]
[]
[]
[]
[]
[]
[null,null,null,null," "," "," "]
[]
[]
[]
[]
[]
[]
[]
[]
[]
[]
[]
[]
[]
[]
[]
[]
["Cotizador de Seguro Médico - Bupa Global Health Plans"]
[]
["Nombre del Asegurado Titular",null,{"$f":"+'INGRESO DE DATOS'!$D$13","v":"NOMBRE COMPLETO"}]
[]
{"$rows_left_out":102}
{"sheet":"Tablas","index":7,"n_rows":1497,"n_cols":19,"rows_kept":1497,"cut":false,"hidden":true,"merged":[[752,0,752,1],[752,2,752,6],[825,0,825,6],[826,0,826,6],[827,0,827,1],[827,2,827,6],[751,0,751,6],[675,0,675,6],[676,0,676,6],[677,0,677,1],[677,2,677,6],[750,0,750,6],[527,0,527,1],[527,2,527,6],[600,0,600,6],[601,0,601,6],[602,0,602,1],[602,2,602,6],[526,0,526,6],[450,0,450,6],[451,0,451,6],[452,0,452,1],[452,2,452,6],[525,0,525,6],[376,0,376,1],[376,2,376,6],[150,0,150,6],[151,0,151,6],[152,0,152,1],[152,2,152,6],[225,0,225,6],[226,0,226,1],[375,0,375,6],[226,2,226,6],[300,0,300,6],[301,0,301,6],[302,0,302,1],[302,2,302,6],[1,0,1,6],[2,0,2,6],[77,0,77,1],[77,2,77,6],[76,0,76,6],[3,0,3,1],[3,2,3,6],[900,0,900,6],[901,0,901,6],[902,0,902,1],[902,2,902,6],[975,0,975,6],[976,0,976,1],[976,2,976,6],[1049,0,1049,6],[1050,0,1050,6],[1051,0,1051,1],[1051,2,1051,6],[1124,0,1124,6],[1125,0,1125,6],[1126,0,1126,1],[1126,2,1126,6],[1199,0,1199,6],[1200,0,1200,1],[1200,2,1200,6],[1273,0,1273,6],[1274,0,1274,6],[1275,0,1275,1],[1275,2,1275,6],[1424,0,1424,6],[1425,0,1425,1],[1425,2,1425,6],[1348,0,1348,6],[1349,0,1349,6],[1350,0,1350,1],[1350,2,1350,6],[1423,0,1423,6]]}
[null,null,null,null,null,null,null,null,null,null,null,null,null,null,null,null,null,"$"]
["BUPA GLOBAL ELITE",null,null,null,null,null,null,null,"FACTOR MENSUAL:",null,{"$f":"1.12/12","v":9.3333333333333338E-2},null,{"$f":"1.12/12","v":9.3333333333333338E-2}]
["TARIFAS ANUALES",null,null,null,null,null,null,null,"FACTOR TRIMESTRAL:",null,0.27500000000000002,null,{"$f":"1.1/4","v":0.27500000000000002}]
["EDAD",null,null,null,null,null,null,null,"FACTOR SEMIANUAL:",null,0.53,null,{"$f":"1.06/2","v":0.53}]
[" "," ",250,2000,3500,5000,10000,null,"Descuento (20%):",null,{"$f":"100%-20%","v":0.8},null,{"$f":"100%-20%","v":0.8},null,250,2000,3500,5000,10000]
[18,null,7488,6561,5519,4786,3712,null,7488,6561,5519,4786,3712,null,true,true,true,true,true]
[19,null,7488,6561,5519,4786,3712,null,7488,6561,5519,4786,3712,null,true,true,true,true,true]
[20,null,7488,6561,5519,4786,3712,null,7488,6561,5519,4786,3712,null,true,true,true,true,true]
[21,null,7488,6561,5519,4786,3712,null,7488,6561,5519,4786,3712,null,true,true,true,true,true]
[22,null,7488,6561,5519,4786,3712,null,7488,6561,5519,4786,3712,null,true,true,true,true,true]
[23,null,7488,6561,5519,4786,3712,null,7488,6561,5519,4786,3712,null,true,true,true,true,true]
[24,null,7488,6561,5519,4786,3712,null,7488,6561,5519,4786,3712,null,true,true,true,true,true]
[25,null,8002,7014,5864,5085,3944,null,8002,7014,5864,5085,3944,null,true,true,true,true,true]
[26,null,8002,7014,5864,5085,3944,null,8002,7014,5864,5085,3944,null,true,true,true,true,true]
[27,null,8002,7014,5864,5085,3944,null,8002,7014,5864,5085,3944,null,true,true,true,true,true]
[28,null,8002,7014,5864,5085,3944,null,8002,7014,5864,5085,3944,null,true,true,true,true,true]
[29,null,8002,7014,5864,5085,3944,null,8002,7014,5864,5085,3944,null,true,true,true,true,true]
[30,null,8901,7802,6472,5611,4353,null,8901,7802,6472,5611,4353,null,true,true,true,true,true]
[31,null,8901,7802,6472,5611,4353,null,8901,7802,6472,5611,4353,null,true,true,true,true,true]
[32,null,8901,7802,6472,5611,4353,null,8901,7802,6472,5611,4353,null,true,true,true,true,true]
[33,null,8901,7802,6472,5611,4353,null,8901,7802,6472,5611,4353,null,true,true,true,true,true]
[34,null,8901,7802,6472,5611,4353,null,8901,7802,6472,5611,4353,null,true,true,true,true,true]
[35,null,9937,8710,7185,6229,4831,null,9937,8710,7185,6229,4831,null,true,true,true,true,true]
[36,null,9937,8710,7185,6229,4831,null,9937,8710,7185,6229,4831,null,true,true,true,true,true]
[37,null,9937,8710,7185,6229,4831,null,9937,8710,7185,6229,4831,null,true,true,true,true,true]
[38,null,9937,8710,7185,6229,4831,null,9937,8710,7185,6229,4831,null,true,true,true,true,true]
[39,null,9937,8710,7185,6229,4831,null,9937,8710,7185,6229,4831,null,true,true,true,true,true]
[40,null,11134,9757,8013,6948,5389,null,11134,9757,8013,6948,5389,null,true,true,true,true,true]
[41,null,11134,9757,8013,6948,5389,null,11134,9757,8013,6948,5389,null,true,true,true,true,true]
[42,null,11134,9757,8013,6948,5389,null,11134,9757,8013,6948,5389,null,true,true,true,true,true]
{"$rows_left_out":1467}