{"text_format":"1","workbook":"xlsx","n_sheets":5,"sheets":["INGRESO DE DATOS","Bupa Essential Flex 1","Bupa Essential Flex 2","Resumen tarifas","Tablas"],"not_rendered":{"charts":0,"images":7,"macros":1,"external_links":0,"defined_names":3,"comments":1,"pivot_tables":0},"unopened":[],"bounds":{"document_bytes":16777216,"sheet_cells":100000,"rows_first":2000,"rows_last":500,"rows_between":2000,"halvings":0,"cell_chars":16384,"cell_head_chars":4096},"cells_cut":0,"cells_raw":0,"read":"whole","date_system":"1900"}

{"sheet":"INGRESO DE DATOS","index":0,"n_rows":25,"n_cols":9,"rows_kept":25,"cut":false,"hidden":false,"merged":[[20,3,20,7],[10,0,10,12],[18,5,18,6],[14,1,14,2],[16,1,16,2],[14,3,14,7],[16,5,16,6],[18,1,18,2]]}
[]
[null,null,null,null,null,null,null," "," "]
[]
[]
[]
[null,null,null,null,null,null,null," "," "]
[]
[]
[]
[]
[]
[]
["LLENE LA INFORMACIÓN DEL ASEGURADO PROPUESTO:"]
[]
[null,"Nombre del Asegurado Titular:",null,"JOHN DOE"]
[]
[null,"Número de adultos en la póliza:",null,2,null,"Número de niños en la póliza:",null,2]
[]
[null,"Edad del Asegurado Titular:",null,32,null,"Edad del/la cónyuge:",null,46]
[]
[null,null,"Cotizador por:","NOMBRE DE AGENTE"]
[]
[]
[]
["SELECCIONE EL PRODUCTO PARA VER LA COTIZACIÓN CORRESPONDIENTE: "]

{"sheet":"Bupa Essential Flex 1","index":1,"n_rows":72,"n_cols":12,"rows_kept":72,"cut":false,"hidden":false,"merged":[[71,4,72,11],[59,0,59,1],[70,0,70,1],[74,0,74,1],[9,5,9,10],[11,5,11,10],[38,0,38,1],[39,1,40,1],[39,0,40,0],[19,4,19,5],[9,0,10,1],[11,0,11,1],[84,0,84,1],[9,3,9,4],[13,3,13,4],[15,3,15,4],[48,4,48,5],[49,4,49,5],[61,4,61,5],[62,4,62,5],[23,4,23,11],[33,4,33,11],[44,4,44,11],[57,4,57,11],[55,0,55,1],[18,0,18,1],[33,0,33,1],[70,4,70,11]]}
[]
[]
[]
[]
[]
[]
[]
[]
[]
["Beneficios: Bupa Essential Flex 1",null,null,"Nombre del Asegurado Titular:",null,{"$f":"+'INGRESO DE DATOS'!$D$15","v":"JOHN DOE"}]
[]
[null,null,null,null,"Cotizado por:",{"$f":"+'INGRESO DE DATOS'!$D$21","v":"NOMBRE DE AGENTE"}]
[]
[null,null,null,"Número de adultos en la póliza:",null,{"$f":"+'INGRESO DE DATOS'!$D$17","v":2},null,null,null,"Edad del Asegurado Titular:",{"$f":"+'INGRESO DE DATOS'!$D$19","v":32}]
[]
[null,null,null,"Número de niños en la póliza:",null,{"$f":"+'INGRESO DE DATOS'!$H$17","v":2},null,null,null,"Edad del/la conyuge:",{"$f":"+'INGRESO DE DATOS'!$H$19","v":46}]
[null,null,null,null,null,null,null,null,null," "," "]
[null,null,null,null,"Fecha de la cotización :",{"$f":"NOW()","v":"2023-02-24T15:12:22.900"}]
[null,null,null,null,null,null," ",null,null,false,null," "]
[null,null,null,null,"DEDUCIBLES",null,"PLAN 1","PLAN 2","PLAN 3","PLAN 4","PLAN 5","PLAN 6"]
[null,null,null,null,"En el país de residencia",null,250,500,1000,2000,5000,10000]
[null,null,null,null,"Fuera del país de residencia",null,500,1000,2000,4000,5000,10000]
[]
[null,null,null,null,"Tarifas Anuales"]
[null,null,null,null,"Prima para Asegurado Titular",null,{"$f":"(VLOOKUP($K$14,Tablas!$A$155:$H$221,3,TRUE))*1.1494","v":2830.9722000000002},{"$f":"(VLOOKUP($K$14,Tablas!$A$155:$H$221,4,TRUE))*1.1494","v":2464.3136},{"$f":"(VLOOKUP($K$14,Tablas!$A$155:$H$221,5,TRUE))*1.1494","v":2244.7781999999997},{"$f":"(VLOOKUP($K$14,Tablas!$A$155:$H$221,6,TRUE))*1.1494","v":1852.8327999999999},{"$f":"(VLOOKUP($K$14,Tablas!$A$155:$H$221,7,TRUE))*1.1494","v":1360.8896},{"$f":"(VLOOKUP($K$14,Tablas!$A$155:$H$221,8,TRUE))*1.1494","v":1149.4000000000001}]
[null,null,null,null,"Prima para conyuge",null,{"$f":"(IF($F$14=1,0,(VLOOKUP($K$16,Tablas!$A$155:$H$221,3,TRUE))))*1.1494","v":4328.6404000000002},{"$f":"(IF($F$14=1,0,(VLOOKUP($K$16,Tablas!$A$155:$H$221,4,TRUE))))*1.1494","v":3764.2849999999999},{"$f":"(IF($F$14=1,0,(VLOOKUP($K$16,Tablas!$A$155:$H$221,5,TRUE))))*1.1494","v":3434.4072000000001},{"$f":"(IF($F$14=1,0,(VLOOKUP($K$16,Tablas!$A$155:$H$221,6,TRUE))))*1.1494","v":2957.4061999999999},{"$f":"(IF($F$14=1,0,(VLOOKUP($K$16,Tablas!$A$155:$H$221,7,TRUE))))*1.1494","v":2134.4357999999997},{"$f":"(IF($F$14=1,0,(VLOOKUP($K$16,Tablas!$A$155:$H$221,8,TRUE))))*1.1494","v":1801.1098}]
[null,null,null,null,"Prima para hijo (s)",null,{"$f":"(IF($F$16=0,0,(VLOOKUP($F$16,Tablas!$A$222:$H$224,3,TRUE))))*1.1494","v":1930.992},{"$f":"(IF($F$16=0,0,(VLOOKUP($F$16,Tablas!$A$222:$H$224,4,TRUE))))*1.1494","v":1681.5722000000001},{"$f":"(IF($F$16=0,0,(VLOOKUP($F$16,Tablas!$A$222:$H$224,5,TRUE))))*1.1494","v":1533.2996000000001},{"$f":"(IF($F$16=0,0,(VLOOKUP($F$16,Tablas!$A$222:$H$224,6,TRUE))))*1.1494","v":798.83299999999997},{"$f":"(IF($F$16=0,0,(VLOOKUP($F$16,Tablas!$A$222:$H$224,7,TRUE))))*1.1494","v":708.03039999999999},{"$f":"(IF($F$16=0,0,(VLOOKUP($F$16,Tablas!$A$222:$H$224,8,TRUE))))*1.1494","v":597.68799999999999}]
[null,null,null,null,"Total de Prima neta",null,{"$f":"(SUM(G25:G27))","v":9090.6046000000006},{"$f":"(SUM(H25:H27))","v":7910.1707999999999},7212.4850000000006,{"$f":"(SUM(J25:J27))","v":5609.0719999999992},{"$f":"(SUM(K25:K27))","v":4203.3557999999994},{"$f":"(SUM(L25:L27))","v":3548.1977999999999}]
[null,null,null,null,"Costo Administrativo Anual",null,{"$f":"50*1.1494","v":57.47},{"$f":"50*1.1494","v":57.47},57.47,57.47,57.47,57.47]
[null,null,null,null," IVA (14.49%) ",null,{"$f":"(G29)*0%","v":0},null,null,{"$f":"(J29)*0%","v":0},{"$f":"(K29)*0%","v":0},{"$f":"(L29)*0%","v":0}]
[]
[null,null,null,null,"TOTAL ANUAL",null,{"$f":"SUM(G28:G30)","v":9148.0745999999999},{"$f":"SUM(H28:H30)","v":7967.6408000000001},7269.9550000000008,{"$f":"SUM(J28:J30)","v":5666.5419999999995},{"$f":"SUM(K28:K30)","v":4260.8257999999996},{"$f":"SUM(L28:L30)","v":3605.6677999999997}]
[]
[null,null,null,null,"Tarifas Semianuales"]
[null,null,null,null,"Prima para Asegurado Titular",null,{"$f":"(VLOOKUP($K$14,Tablas!$A$530:$H$596,3,TRUE))*1.1494","v":1457.9506829999998},{"$f":"(VLOOKUP($K$14,Tablas!$A$530:$H$596,4,TRUE))*1.1494","v":1269.121504},{"$f":"(VLOOKUP($K$14,Tablas!$A$530:$H$596,5,TRUE))*1.1494","v":1156.0607730000002},{"$f":"(VLOOKUP($K$14,Tablas!$A$530:$H$596,6,TRUE))*1.1494","v":954.20889200000011},{"$f":"(VLOOKUP($K$14,Tablas!$A$530:$H$596,7,TRUE))*1.1494","v":700.85814399999992},{"$f":"(VLOOKUP($K$14,Tablas!$A$530:$H$596,8,TRUE))*1.1494","v":591.94100000000003}]
[null,null,null,null,"Prima para conyuge",null,{"$f":"(IF($F$14=1,0,(VLOOKUP($K$16,Tablas!$A$530:$H$596,3,TRUE))))*1.1494","v":2229.2498059999998},{"$f":"(IF($F$14=1,0,(VLOOKUP($K$16,Tablas!$A$530:$H$596,4,TRUE))))*1.1494","v":1938.606775},{"$f":"(IF($F$14=1,0,(VLOOKUP($K$16,Tablas!$A$530:$H$596,5,TRUE))))*1.1494","v":1768.7197079999999},{"$f":"(IF($F$14=1,0,(VLOOKUP($K$16,Tablas!$A$530:$H$596,6,TRUE))))*1.1494","v":1523.0641929999999},{"$f":"(IF($F$14=1,0,(VLOOKUP($K$16,Tablas!$A$530:$H$596,7,TRUE))))*1.1494","v":1099.2344370000001},{"$f":"(IF($F$14=1,0,(VLOOKUP($K$16,Tablas!$A$530:$H$596,8,TRUE))))*1.1494","v":927.57154700000001}]
[null,null,null,null,"Prima para hijo (s)",null,{"$f":"(IF($F$16=0,0,(VLOOKUP($F$16,Tablas!$A$597:$H$599,3,TRUE))))*1.1494","v":994.46088000000009},{"$f":"(IF($F$16=0,0,(VLOOKUP($F$16,Tablas!$A$597:$H$599,4,TRUE))))*1.1494","v":866.009683},{"$f":"(IF($F$16=0,0,(VLOOKUP($F$16,Tablas!$A$597:$H$599,5,TRUE))))*1.1494","v":789.64929399999994},{"$f":"(IF($F$16=0,0,(VLOOKUP($F$16,Tablas!$A$597:$H$599,6,TRUE))))*1.1494","v":411.39899500000001},{"$f":"(IF($F$16=0,0,(VLOOKUP($F$16,Tablas!$A$597:$H$599,7,TRUE))))*1.1494","v":364.63565599999998},{"$f":"(IF($F$16=0,0,(VLOOKUP($F$16,Tablas!$A$597:$H$599,8,TRUE))))*1.1494","v":307.80932000000001}]
[null,null,null,null,"Total de Prima neta",null,{"$f":"(SUM(G35:G37))","v":4681.6613689999995},{"$f":"(SUM(H35:H37))","v":4073.7379620000002},3714.4297749999996,{"$f":"(SUM(J35:J37))","v":2888.6720799999998},{"$f":"(SUM(K35:K37))","v":2164.7282369999998},{"$f":"(SUM(L35:L37))","v":1827.3218670000001}]
[null,null,null,null,"Costo Administrativo Anual",null,{"$f":"50*1.1494","v":57.47},{"$f":"50*1.1494","v":57.47},57.47,57.47,57.47,57.47]
[null,null,null,null," IVA (14.49%) ",null,{"$f":"(G39)*0%","v":0},null,null,{"$f":"(J39)*0%","v":0},{"$f":"(K39)*0%","v":0},{"$f":"(L39)*0%","v":0}]
{"$rows_left_out":33}
{"sheet":"Bupa Essential Flex 2","index":2,"n_rows":73,"n_cols":12,"rows_kept":73,"cut":false,"hidden":false,"merged":[[72,4,73,11],[25,4,25,11],[35,4,35,11],[46,4,46,11],[59,4,59,11],[71,4,71,11],[63,4,63,5],[64,4,64,5],[56,0,56,1],[60,0,60,1],[71,0,71,1],[75,0,75,1],[85,0,85,1],[40,1,41,1],[40,0,41,0],[50,4,50,5],[51,4,51,5],[19,0,19,1],[34,0,34,1],[39,0,39,1],[10,3,10,4],[14,3,14,4],[10,5,10,10],[12,5,12,10],[9,0,10,1]]}
[]
[]
[]
[]
[]
[]
[]
[]
[]
["Beneficios: Bupa Essential Flex 2"]
[null,null,null,"Nombre del Asegurado Titular:",null,{"$f":"+'INGRESO DE DATOS'!$D$15","v":"JOHN DOE"}]
[]
[null,null,null,null,"Cotizado por:",{"$f":"+'INGRESO DE DATOS'!$D$21","v":"NOMBRE DE AGENTE"}]
[]
[null,null,null,"Número de adultos en la póliza:",null,{"$f":"+'INGRESO DE DATOS'!$D$17","v":2},null,null,null,"Edad del Asegurado Titular:",{"$f":"+'INGRESO DE DATOS'!$D$19","v":32}]
[]
[null,null,null,null,"Número de niños en la póliza:",{"$f":"+'INGRESO DE DATOS'!$H$17","v":2},null,null,null,"Edad del/la conyuge:",{"$f":"+'INGRESO DE DATOS'!$H$19","v":46}]
[null,null,null,null,null,null,null,null,null," "," "]
[null,null,null,null,"Fecha de la cotización:",{"$f":"NOW()","v":"2023-02-24T15:12:22.900"}]
[]
[null,null,null,null,null,null," ",null,null,false,null," "]
[null,null,null,null,"DEDUCIBLES",null,"PLAN 1","PLAN 2","PLAN 3","PLAN 4","PLAN 5","PLAN 6"]
[null,null,null,null,"En el país de residencia",null,250,500,1000,2000,5000,10000]
[null,null,null,null,"Fuera del país de residencia",null,500,1000,2000,4000,5000,10000]
[]
[null,null,null,null,"Tarifas Anuales"]
[null,null,null,null,"Prima para Asegurado Titular",null,{"$f":"(VLOOKUP($K$15,Tablas!$A$305:$H$371,3,TRUE))*1.1494","v":2264.3179999999998},{"$f":"(VLOOKUP($K$15,Tablas!$A$305:$H$371,4,TRUE))*1.1494","v":1971.221},{"$f":"(VLOOKUP($K$15,Tablas!$A$305:$H$371,5,TRUE))*1.1494","v":1795.3627999999999},{"$f":"(VLOOKUP($K$15,Tablas!$A$305:$H$371,6,TRUE))*1.1494","v":1481.5765999999999},{"$f":"(VLOOKUP($K$15,Tablas!$A$305:$H$371,7,TRUE))*1.1494","v":1087.3324},{"$f":"(VLOOKUP($K$15,Tablas!$A$305:$H$371,8,TRUE))*1.1494","v":917.22119999999995}]
[null,null,null,null,"Prima para conyuge",null,{"$f":"(IF($F$15=1,0,(VLOOKUP($K$17,Tablas!$A$305:$H$371,3,TRUE))))*1.1494","v":3461.9928},{"$f":"(IF($F$15=1,0,(VLOOKUP($K$17,Tablas!$A$305:$H$371,4,TRUE))))*1.1494","v":3012.5774000000001},{"$f":"(IF($F$15=1,0,(VLOOKUP($K$17,Tablas!$A$305:$H$371,5,TRUE))))*1.1494","v":2748.2154},{"$f":"(IF($F$15=1,0,(VLOOKUP($K$17,Tablas!$A$305:$H$371,6,TRUE))))*1.1494","v":2366.6145999999999},{"$f":"(IF($F$15=1,0,(VLOOKUP($K$17,Tablas!$A$305:$H$371,7,TRUE))))*1.1494","v":1706.8589999999999},{"$f":"(IF($F$15=1,0,(VLOOKUP($K$17,Tablas!$A$305:$H$371,8,TRUE))))*1.1494","v":1441.3476000000001}]
[null,null,null,null,"Prima para hijo (s)",null,{"$f":"(IF($F$17=0,0,(VLOOKUP($F$17,Tablas!$A$372:$H$374,3,TRUE))))*1.1494","v":1547.0924},{"$f":"(IF($F$17=0,0,(VLOOKUP($F$17,Tablas!$A$372:$H$374,4,TRUE))))*1.1494","v":1347.0968},{"$f":"(IF($F$17=0,0,(VLOOKUP($F$17,Tablas!$A$372:$H$374,5,TRUE))))*1.1494","v":1226.4097999999999},{"$f":"(IF($F$17=0,0,(VLOOKUP($F$17,Tablas!$A$372:$H$374,6,TRUE))))*1.1494","v":640.21579999999994},{"$f":"(IF($F$17=0,0,(VLOOKUP($F$17,Tablas!$A$372:$H$374,7,TRUE))))*1.1494","v":565.50479999999993},{"$f":"(IF($F$17=0,0,(VLOOKUP($F$17,Tablas!$A$372:$H$374,8,TRUE))))*1.1494","v":479.2998}]
[null,null,null,null,"Total de Prima neta",null,{"$f":"(SUM(G27:G29))","v":7273.4031999999988},{"$f":"(SUM(H27:H29))","v":6330.8951999999999},5769.9879999999994,{"$f":"(SUM(J27:J29))","v":4488.4069999999992},{"$f":"(SUM(K27:K29))","v":3359.6961999999994},{"$f":"(SUM(L27:L29))","v":2837.8685999999998}]
[null,null,null,null,"Costo Administrativo Anual",null,{"$f":"50*1.1494","v":57.47},{"$f":"50*1.1494","v":57.47},57.47,57.47,57.47,57.47]
[null,null,null,null,"  IVA (14.49%)  ",null,{"$f":"(G31)*0%","v":0},{"$f":"(H31)*0%","v":0},0,{"$f":"(J31)*0%","v":0},{"$f":"(K31)*0%","v":0},{"$f":"(L31)*0%","v":0}]
[]
[null,null,null,null,"TOTAL ANUAL",null,{"$f":"SUM(G30:G32)","v":7330.8731999999991},{"$f":"SUM(H30:H32)","v":6388.3652000000002},5827.4579999999996,{"$f":"SUM(J30:J32)","v":4545.8769999999995},{"$f":"SUM(K30:K32)","v":3417.1661999999992},{"$f":"SUM(L30:L32)","v":2895.3385999999996}]
[]
[null,null,null,null,"Tarifas Semianuales"]
[null,null,null,null,"Prima para Asegurado Titular",null,{"$f":"(VLOOKUP($K$15,Tablas!$A$605:$H$671,3,TRUE))*1.1494","v":1166.1237700000001},{"$f":"(VLOOKUP($K$15,Tablas!$A$605:$H$671,4,TRUE))*1.1494","v":1015.178815},{"$f":"(VLOOKUP($K$15,Tablas!$A$605:$H$671,5,TRUE))*1.1494","v":924.61184200000002},{"$f":"(VLOOKUP($K$15,Tablas!$A$605:$H$671,6,TRUE))*1.1494","v":763.01194900000007},{"$f":"(VLOOKUP($K$15,Tablas!$A$605:$H$671,7,TRUE))*1.1494","v":559.97618599999998},{"$f":"(VLOOKUP($K$15,Tablas!$A$605:$H$671,8,TRUE))*1.1494","v":472.36891800000001}]
[null,null,null,null,"Prima para conyuge",null,{"$f":"(IF($F$15=1,0,(VLOOKUP($K$17,Tablas!$A$605:$H$671,3,TRUE))))*1.1494","v":1782.9262920000001},{"$f":"(IF($F$15=1,0,(VLOOKUP($K$17,Tablas!$A$605:$H$671,4,TRUE))))*1.1494","v":1551.477361},{"$f":"(IF($F$15=1,0,(VLOOKUP($K$17,Tablas!$A$605:$H$671,5,TRUE))))*1.1494","v":1415.330931},{"$f":"(IF($F$15=1,0,(VLOOKUP($K$17,Tablas!$A$605:$H$671,6,TRUE))))*1.1494","v":1218.806519},{"$f":"(IF($F$15=1,0,(VLOOKUP($K$17,Tablas!$A$605:$H$671,7,TRUE))))*1.1494","v":879.03238499999998},{"$f":"(IF($F$15=1,0,(VLOOKUP($K$17,Tablas!$A$605:$H$671,8,TRUE))))*1.1494","v":742.29401400000006}]
[null,null,null,null,"Prima para hijo (s)",null,{"$f":"(IF($F$17=0,0,(VLOOKUP($F$17,Tablas!$A$672:$H$674,3,TRUE))))*1.1494","v":796.75258600000006},{"$f":"(IF($F$17=0,0,(VLOOKUP($F$17,Tablas!$A$672:$H$674,4,TRUE))))*1.1494","v":693.75485200000003},{"$f":"(IF($F$17=0,0,(VLOOKUP($F$17,Tablas!$A$672:$H$674,5,TRUE))))*1.1494","v":631.60104699999999},{"$f":"(IF($F$17=0,0,(VLOOKUP($F$17,Tablas!$A$672:$H$674,6,TRUE))))*1.1494","v":329.71113700000001},{"$f":"(IF($F$17=0,0,(VLOOKUP($F$17,Tablas!$A$672:$H$674,7,TRUE))))*1.1494","v":291.23497199999997},{"$f":"(IF($F$17=0,0,(VLOOKUP($F$17,Tablas!$A$672:$H$674,8,TRUE))))*1.1494","v":246.83939699999999}]
[null,null,null,null,"Total de Prima neta",null,{"$f":"(SUM(G37:G39))","v":3745.8026480000003},{"$f":"(SUM(H37:H39))","v":3260.411028},2971.5438199999999,{"$f":"(SUM(J37:J39))","v":2311.5296049999997},{"$f":"(SUM(K37:K39))","v":1730.2435429999998},{"$f":"(SUM(L37:L39))","v":1461.5023290000001}]
{"$rows_left_out":34}
{"sheet":"Resumen tarifas","index":3,"n_rows":73,"n_cols":10,"rows_kept":73,"cut":false,"hidden":false,"merged":[[37,4,37,9],[39,4,39,9],[19,0,19,9],[72,0,74,6],[55,0,55,1],[60,0,60,1],[57,0,57,1],[58,0,58,1],[69,0,69,1],[61,4,61,9],[71,0,71,9],[56,0,56,1],[59,0,59,1],[54,0,54,1],[50,1,50,3],[53,0,53,1],[68,0,68,3],[67,0,67,3],[21,2,21,6],[24,4,24,5],[27,4,27,5],[21,0,21,1],[24,0,24,1],[22,2,22,6],[27,0,27,1],[34,0,34,1],[44,0,44,1],[37,0,37,1],[38,0,38,1],[39,0,39,1],[41,0,41,1],[42,0,42,1],[55,4,55,9],[58,4,58,9],[40,0,40,1],[43,0,43,1],[42,4,42,9],[45,4,45,9],[53,4,53,9]]}
[]
[null,null,null,null," "," "]
[]
[]
[]
[null,null,null,null," "," "," "]
[]
[]
[]
[]
[]
[]
[]
[]
[]
[]
[]
[]
[]
["Cotización de Seguro Médico - Bupa Essential Flex Plan"]
[]
["Nombre del Asegurado Titular",null,{"$f":"+'INGRESO DE DATOS'!$D$15","v":"JOHN DOE"}]
[null,"Cotizado por",{"$f":"+'INGRESO DE DATOS'!$D$21","v":"NOMBRE DE AGENTE"}]
[]
["Número de adultos en la póliza",null,{"$f":"+'INGRESO DE DATOS'!$D$17","v":2},null,"Edad del Asegurado Titular",null,{"$f":"+'INGRESO DE DATOS'!$D$19","v":32}]
[]
[]
["Número de niños en la póliza",null,{"$f":"+'INGRESO DE DATOS'!$H$17","v":2},null,"Edad del/la cónyuge ",null,{"$f":"+'INGRESO DE DATOS'!$H$19","v":46}]
[]
[]
[null,null,"Fecha de la Cotización:",{"$f":"NOW()","v":"2023-02-24T15:12:22.900"}]
[]
[]
["BUPA ESSENTIAL FLEX 1"]
["DEDUCIBLES",null,null,null,"PLAN 1","PLAN 2","PLAN 3","PLAN 4","PLAN 5","PLAN 6"]
["En el país de residencia",null,null,null,250,500,1000,2000,5000,10000]
["Fuera del país de residencia",null,null,null,500,1000,2000,4000,5000,10000]
[null,null,null,null,"Tarifas Anuales"]
[null,null,null,null,{"$f":"+'Bupa Essential Flex 1'!G32","v":9148.0745999999999},{"$f":"+'Bupa Essential Flex 1'!H32","v":7967.6408000000001},{"$f":"+'Bupa Essential Flex 1'!I32","v":7269.9550000000008},{"$f":"+'Bupa Essential Flex 1'!J32","v":5666.5419999999995},{"$f":"+'Bupa Essential Flex 1'!K32","v":4260.8257999999996},{"$f":"+'Bupa Essential Flex 1'!L32","v":3605.6677999999997}]
[null,null,null,null,"Tarifas Semi-anuales"]
{"$rows_left_out":34}
{"sheet":"Tablas","index":4,"n_rows":1497,"n_cols":12,"rows_kept":1497,"cut":false,"hidden":true,"merged":[[1424,0,1424,7],[1425,0,1425,1],[1425,2,1425,7],[1348,0,1348,7],[1349,0,1349,7],[1350,0,1350,1],[1350,2,1350,7],[1423,0,1423,7],[1200,0,1200,1],[1200,2,1200,7],[1273,0,1273,7],[1274,0,1274,7],[1275,0,1275,1],[1275,2,1275,7],[1124,0,1124,7],[1125,0,1125,7],[1126,0,1126,1],[1126,2,1126,7],[1199,0,1199,7],[976,0,976,1],[976,2,976,7],[1049,0,1049,7],[1050,0,1050,7],[1051,0,1051,1],[1051,2,1051,7],[900,0,900,7],[901,0,901,7],[902,0,902,1],[902,2,902,7],[975,0,975,7],[1,0,1,7],[2,0,2,7],[77,0,77,1],[77,2,77,7],[76,0,76,7],[3,0,3,1],[3,2,3,7],[376,0,376,1],[376,2,376,7],[150,0,150,7],[151,0,151,7],[152,0,152,1],[152,2,152,7],[225,0,225,7],[226,0,226,1],[375,0,375,7],[226,2,226,7],[300,0,300,7],[301,0,301,7],[302,0,302,1],[302,2,302,7],[526,0,526,7],[450,0,450,7],[451,0,451,7],[452,0,452,1],[452,2,452,7],[525,0,525,7],[527,0,527,1],[527,2,527,7],[600,0,600,7],[601,0,601,7],[602,0,602,1],[602,2,602,7],[751,0,751,7],[675,0,675,7],[676,0,676,7],[677,0,677,1],[677,2,677,7],[750,0,750,7],[752,0,752,1],[752,2,752,7],[825,0,825,7],[826,0,826,7],[827,0,827,1],[827,2,827,7]]}
[]
["BUPA GLOBAL ELITE",null,null,null,null,null,null,null,null,"FACTOR MENSUAL:",null,{"$f":"1.06/12","v":8.8333333333333333E-2}]
["TARIFAS ANUALES",null,null,null,null,null,null,null,null,"FACTOR TRIMESTRAL:",null,0.26124999999999998]
["EDAD",null,null,null,null,null,null,null,null,"FACTOR SEMIANUAL:",null,0.51500000000000001]
[" "," ",250,null,null,2000,3500,5000]
[18]
[19]
[20]
[21]
[22]
[23]
[24]
[25]
[26]
[27]
[28]
[29]
[30]
[31]
[32]
[33]
[34]
[35]
[36]
[37]
[38]
[39]
[40]
[41]
[42]
[43]
[44]
[45]
[46]
[47]
[48]
[49]
[50]
[51]
[52]
{"$rows_left_out":1457}